{"text_format":"1","workbook":"xlsx","n_sheets":10,"sheets":["DKB","Einzelergebnisse","MANNSCHAFTEN+SPIELER","Daten","Anleitung","Dialog","Dialog2","Dialog3","übertrag","VBA-Modul"],"not_rendered":{"charts":0,"images":1,"macros":1,"external_links":1,"defined_names":137,"comments":1,"pivot_tables":0},"unopened":[{"sheet":"Dialog","index":5,"reason":"not_a_worksheet"},{"sheet":"Dialog2","index":6,"reason":"not_a_worksheet"},{"sheet":"Dialog3","index":7,"reason":"not_a_worksheet"},{"sheet":"VBA-Modul","index":9,"reason":"part_missing"}],"bounds":{"document_bytes":16777216,"sheet_cells":100000,"rows_first":2000,"rows_last":500,"rows_between":2000,"halvings":0,"cell_chars":16384,"cell_head_chars":4096},"cells_cut":0,"cells_raw":0,"read":"whole","date_system":"1900"}

{"sheet":"DKB","index":0,"n_rows":64,"n_cols":25,"rows_kept":64,"cut":false,"hidden":false,"merged":[[7,3,7,10],[9,7,9,8],[19,7,19,8],[23,7,23,8],[17,10,21,10],[10,10,14,10],[20,1,21,3],[9,1,9,3],[60,2,60,24],[61,0,61,24],[62,0,62,24],[19,15,19,17],[17,15,18,17],[24,15,25,17],[23,15,23,17],[20,15,21,17],[10,1,11,3],[13,1,14,3],[19,1,19,3],[23,1,23,3],[20,7,20,8],[21,7,21,8],[64,19,64,25],[64,2,64,5],[63,2,63,5],[64,6,64,10],[63,11,63,15],[63,19,63,24],[25,7,25,8],[64,11,64,15],[24,10,28,10],[28,7,28,8],[27,7,27,8],[26,7,26,8],[30,15,30,17],[44,15,44,17],[42,7,42,8],[31,7,31,8],[26,1,26,3],[27,1,28,3],[24,7,24,8],[24,1,25,3],[53,4,53,8],[53,18,53,21],[51,21,51,22],[50,21,50,22],[47,1,47,3],[47,15,47,17],[48,1,49,3],[48,15,49,17],[48,7,48,8],[47,7,47,8],[49,7,49,8],[30,21,30,22],[31,10,35,10],[33,15,33,17],[38,10,42,10],[43,21,43,22],[32,21,32,22],[34,1,35,3],[30,1,30,3],[31,1,32,3],[41,1,42,3],[45,1,46,3],[33,1,33,3],[44,1,44,3],[37,1,37,3],[38,1,39,3],[40,1,40,3],[45,24,49,24],[45,10,49,10],[45,15,46,17],[48,21,48,22],[49,21,49,22],[47,21,47,22],[46,21,46,22],[45,21,45,22],[31,24,35,24],[38,24,42,24],[40,15,40,17],[31,15,32,17],[38,15,39,17],[41,15,42,17],[34,15,35,17],[34,21,34,22],[33,21,33,22],[37,15,37,17],[10,24,14,24],[9,15,9,17],[10,21,10,22],[16,15,16,17],[11,21,11,22],[24,24,28,24],[27,15,28,17],[26,15,26,17],[17,21,17,22],[18,21,18,22],[17,24,21,24],[9,21,9,22],[2,15,2,17],[4,15,4,17],[5,13,5,14],[1,13,1,14],[2,21,2,24],[7,17,7,24],[3,13,3,14],[4,13,4,14],[3,15,3,24],[4,21,4,24],[5,15,5,24],[1,15,1,24],[12,1,12,3],[15,7,15,8],[17,7,17,8],[18,7,18,8],[12,7,12,8],[16,7,16,8],[14,7,14,8],[17,1,18,3],[19,21,19,22],[16,1,16,3],[12,21,12,22],[20,21,20,22],[21,21,21,22],[22,21,22,22],[23,21,23,22],[27,21,27,22],[28,21,28,22],[34,7,34,8],[10,7,10,8],[11,7,11,8],[13,7,13,8],[16,21,16,22],[12,15,12,17],[10,15,11,17],[13,15,14,17],[29,21,29,22],[13,21,13,22],[14,21,14,22],[15,21,15,22],[24,21,24,22],[25,21,25,22],[26,21,26,22],[22,7,22,8],[37,21,37,22],[39,21,39,22],[38,21,38,22],[40,21,40,22],[41,21,41,22],[40,7,40,8],[41,7,41,8],[37,7,37,8],[31,21,31,22],[52,11,52,13],[51,7,51,8],[52,7,52,8],[52,21,52,22],[42,21,42,22],[35,21,35,22],[36,21,36,22],[44,21,44,22],[0,6,0,16],[29,7,29,8],[50,7,50,8],[35,7,35,8],[36,7,36,8],[39,7,39,8],[30,7,30,8],[43,7,43,8],[32,7,32,8],[33,7,33,8],[6,11,6,13],[7,11,7,13],[44,7,44,8],[45,7,45,8],[46,7,46,8],[38,7,38,8]]}
[null,null,null,null,null,null,"Spielleiter: Robert Rammler",null,null,null,null,null,null,null,null,null,null,"Spielbericht"]
[null,null,null,null,"Senioren",null,null,null,null,{"$f":"IF(übertrag!Q11=TRUE,\"X\",\"\")","v":""},null,null,null,"Land:",null,"Deutschland"]
["Klubspiel",null,{"$f":"IF(übertrag!Q2=TRUE,\"X\",\"\")","v":"X"},null,"Frauen",null,null,null,null,{"$f":"IF(übertrag!Q6=TRUE,\"X\",\"\")","v":""},null,null,null,"Ort:",null,{"$f":"Daten!B1","v":"Zeil am Main"},null,null,null,null,"Datum:","2022-01-22"]
["Pokalspiel",null,{"$f":"IF(übertrag!Q3=TRUE,\"X\",\"\")","v":""},null,"Männer",null,null,null,null,{"$f":"IF(übertrag!Q5=TRUE,\"X\",\"\")","v":"X"},null,null,null,"Bahnanlage:",null,{"$f":"Daten!C1","v":"Zeiler EssZimmer"}]
["Länderspiel",null,{"$f":"IF(übertrag!Q4=TRUE,\"X\",\"\")","v":""},null,"U 23",null,null,null,null,{"$f":"IF(übertrag!Q7=TRUE,\"X\",\"\")","v":""},null,null,null,"Spielbeginn:",null,"22.01.2022  13.30",null,null,null,null,"Spielende:",44583.712836342595]
[null,null,null,null,"U 18",null,null,null,null,{"$f":"IF(übertrag!Q8=TRUE,\"X\",\"\")","v":""},null,null,null,"Liga/Klasse:",null,"2. BL Mitte"]
[null,null,null,null,null,null,null,null,null,null,null,"Spiel Nr.",null,null,null,null,null,null,null,null,null,null,null,"Spieltag:",{"$f":"IF(übertrag!AE25=23,\"\",übertrag!AE25)","v":14}]
[null,null,"Heimmannschaft:",{"$f":"'MANNSCHAFTEN+SPIELER'!O3","v":"1.SKK Gut Holz Zeil 1"},null,null,null,null,null,null,null,12081,null,null,null,null,"Gastmannschaft:",{"$f":"IF(übertrag!H2,VLOOKUP(übertrag!H2,Gastmannschaft,2,),\"\")","v":"Rot-Weiß Hirschau"}]
{"$rows_left_out":57}
{"sheet":"Einzelergebnisse","index":1,"n_rows":49,"n_cols":13,"rows_kept":49,"cut":false,"hidden":false,"merged":[[1,7,1,12],[1,0,1,5]]}
[]
[{"$f":"DKB!D8","v":"1.SKK Gut Holz Zeil 1"},null,null,null,null,null,null,{"$f":"DKB!R8","v":"Rot-Weiß Hirschau"}]
[]
["Name","Bahn","Volle","Abr","Fe","Ges",null,"Name","Bahn","Volle","Abr","Fe","Ges"]
[{"$f":"DKB!B11","v":"Holger Jahn"},1,{"$f":"Daten!C5","v":96},{"$f":"Daten!B5","v":61},{"$f":"Daten!A5","v":1},{"$f":"SUM(C5,D5)","v":157},null,{"$f":"DKB!P11","v":"Bastian Baumer"},1,{"$f":"Daten!C47","v":97},{"$f":"Daten!B47","v":72},{"$f":"Daten!A47","v":0},{"$f":"SUM(J5,K5)","v":169}]
[null,2,{"$f":"Daten!C6","v":101},{"$f":"Daten!B6","v":42},{"$f":"Daten!A6","v":0},{"$f":"SUM(C6,D6)","v":143},null,null,2,{"$f":"Daten!C48","v":92},{"$f":"Daten!B48","v":63},{"$f":"Daten!A48","v":0},{"$f":"SUM(J6,K6)","v":155}]
[{"$f":"DKB!B14","v":0},3,{"$f":"Daten!C7","v":84},{"$f":"Daten!B7","v":54},{"$f":"Daten!A7","v":0},{"$f":"SUM(C7,D7)","v":138},null,{"$f":"DKB!P14","v":0},3,{"$f":"Daten!C49","v":88},{"$f":"Daten!B49","v":63},{"$f":"Daten!A49","v":0},{"$f":"SUM(J7,K7)","v":151}]
[null,4,{"$f":"Daten!C8","v":93},{"$f":"Daten!B8","v":53},{"$f":"Daten!A8","v":1},{"$f":"SUM(C8,D8)","v":146},null,null,4,{"$f":"Daten!C50","v":92},{"$f":"Daten!B50","v":35},{"$f":"Daten!A50","v":1},{"$f":"SUM(J8,K8)","v":127}]
{"$rows_left_out":42}
{"sheet":"MANNSCHAFTEN+SPIELER","index":2,"n_rows":233,"n_cols":21,"rows_kept":233,"cut":false,"hidden":false,"merged":[[0,14,0,20],[0,0,0,6]]}
["Gastmannschaften",null,null,null,null,null,null,null,null,null,null,null,null,null,"Heimmannschaft"]
["KLUB / Verein",null,"Mon/Jahr",null,"Paß-     Nummer",null,"Vorname, Name",null,null,null,null,null,null,null,"KLUB / Verein",null,"Mon/Jahr",null,"Paß-     Nummer",null,"Vorname, Name"]
[{"$f":"M2_Start","v":"Rot-Weiß Hirschau"},1,null,1,null,1,null,null,null,null,null,null,null,null,{"$f":"M1_Start","v":"1.SKK Gut Holz Zeil 1"},1,null,1,null,1]
[{"$f":"$A$3","v":"Rot-Weiß Hirschau"},2,{"$f":"TEXT(Daten!B46,\"MM.JJ\")","v":"10.79"},2,{"$f":"Daten!C46","v":107246},2,{"$f":"_Sp21","v":"Bastian Baumer"},null,null,null,null,null,null,null,{"$f":"$O$3","v":"1.SKK Gut Holz Zeil 1"},2,{"$f":"TEXT(Daten!B4,\"MM.JJ\")","v":"06.72"},2,{"$f":"Daten!Pass11","v":120763},2,{"$f":"_Sp11","v":"Holger Jahn"}]
["Rot-Weiß Hirschau",3,{"$f":"TEXT(Daten!B51,\"MM.JJ\")","v":"04.98"},3,{"$f":"Daten!C51","v":16270},3,{"$f":"_SP22","v":"Marcus Gevatter"},null,null,null,null,null,null,null,"1.SKK Gut Holz Zeil 1",3,{"$f":"TEXT(Daten!B9,\"MM.JJ\")","v":"10.03"},3,{"$f":"Daten!C9","v":79060},3,{"$f":"_Sp12","v":"Silvan Meinunger"}]
["Rot-Weiß Hirschau",4,{"$f":"TEXT(Daten!B56,\"MM.JJ\")","v":"07.84"},4,{"$f":"Daten!C56","v":107563},4,{"$f":"_Sp23","v":"Thomas Immer"},null,null,null,null,null,null,null,"1.SKK Gut Holz Zeil 1",4,{"$f":"TEXT(Daten!B14,\"MM.JJ\")","v":"06.00"},4,{"$f":"Daten!C14","v":29339},4,{"$f":"_Sp13","v":"Pascal Österling"}]
["Rot-Weiß Hirschau",5,{"$f":"TEXT(Daten!B61,\"MM.JJ\")","v":"09.96"},5,{"$f":"Daten!C61","v":107632},5,{"$f":"_Sp24","v":"Manuel Donhauser"},null,null,null,null,null,null,null,"1.SKK Gut Holz Zeil 1",5,{"$f":"TEXT(Daten!B19,\"MM.JJ\")","v":"07.69"},5,{"$f":"Daten!C19","v":120769},5,{"$f":"_Sp14","v":"Olaf Pfaller"}]
["Rot-Weiß Hirschau",6,{"$f":"TEXT(Daten!B66,\"MM.JJ\")","v":"01.91"},6,{"$f":"Daten!C66","v":111231},6,{"$f":"_Sp25","v":"Daniel Rösch"},null,null,null,null,null,null,null,"1.SKK Gut Holz Zeil 1",6,{"$f":"TEXT(Daten!B24,\"MM.JJ\")","v":"07.61"},6,{"$f":"Daten!C24","v":120774},6,{"$f":"_Sp15","v":"Georg Schropp"}]
{"$rows_left_out":226}
{"sheet":"Daten","index":3,"n_rows":81,"n_cols":18,"rows_kept":81,"cut":false,"hidden":false,"merged":[]}
["Zeil 1 - Hirschau 22.1.22","Zeil am Main","Zeiler EssZimmer",null,0,0,null,null,null,"22.1.2022,  12.59 Uhr","22.1.2022,  17.00 Uhr"]
[]
["1.SKK Gut Holz Zeil 1","Olaf Pfaller",null,0,null,0,720,3414,12,2267,1147,0,0,0,1,59,32,"2"]
["Holger Jahn","06.72",120763,0,2,210,0,0,0,374,584,0,9,10,"1",0,0]
[1,61,96,157,0]
[0,42,101,143,0]
[0,54,84,138,0]
[1,53,93,146,0]
{"$rows_left_out":74}
{"sheet":"Anleitung","index":4,"n_rows":14,"n_cols":2,"rows_kept":14,"cut":false,"hidden":false,"merged":[[0,0,0,1]]}
["Anleitung"]
[]
["1.","Spieldaten aus dem Controlcenter exportieren."]
["2.","Spieldaten in \"Daten\" in Zelle \"A1\" einfügen."]
["3.","Grunddaten in \"DKB\" anpassen:"]
[null," - über Button \"Eingabe\" Angaben eingeben"]
[null," - Ersatzspieler über die Buttons Heim- u. Auswärtsmannschaft zuordnen"]
[null," - Datum, Spielbeginn u. Spielende manuell eingeben"]
{"$rows_left_out":7}
{"sheet":"übertrag","index":8,"n_rows":117,"n_cols":31,"rows_kept":117,"cut":false,"hidden":true,"merged":[[0,16,0,17]]}
[null,null,null,null,null,null,null,null,null,null,"Spieler 1 - 6","Spieler 7 - 12","geb.jahr 1 - 6","geb.jahr 7 - 12 - 6","paß.Nr 1 - 6","paß.Nr 7 - 12","Eingane der Kreuze",null,null,null,null,"Gastmannschaft",null,"Heim",null,null,null,null,null,null,"Spieltag"]
[13,9,9,13,null,4,null,1,2,null,{"$f":"IF(übertrag!$H$2=1,VLOOKUP(übertrag!I2,einsü,2,),IF($H$2=2,VLOOKUP(übertrag!I2,zweiü,2,),IF($H$2=3,VLOOKUP(übertrag!I2,dreiü,2,),IF($H$2=4,VLOOKUP(übertrag!I2,vierü,2,),IF($H$2=5,VLOOKUP(übertrag!I2,fünfü,2,),IF($H$2=6,VLOOKUP(übertrag!I2,sechsü,2,),\"\"))))))","v":"Bastian Baumer"},{"$f":"IF(übertrag!$H$2=7,VLOOKUP(übertrag!I2,siebenü,2,),IF($H$2=8,VLOOKUP(übertrag!I2,achtü,2,),IF($H$2=9,VLOOKUP(übertrag!I2,neunü,2,),IF($H$2=10,VLOOKUP(übertrag!I2,zehnü,2,),IF($H$2=11,VLOOKUP(übertrag!I2,elfü,2,),IF($H$2=12,VLOOKUP(übertrag!I2,Heimü,2,),\"\"))))))","v":""},{"$f":"IF(übertrag!$H$2=1,VLOOKUP(übertrag!I2,_jhg1,2,),IF($H$2=2,VLOOKUP(übertrag!I2,_jhg2,2,),IF($H$2=3,VLOOKUP(übertrag!I2,_jhg3,2,),IF($H$2=4,VLOOKUP(übertrag!I2,_jhg4,2,),IF($H$2=5,VLOOKUP(übertrag!I2,_jhg5,2,),IF($H$2=6,VLOOKUP(übertrag!I2,_jhg6,2,),\"\"))))))","v":"10.79"},{"$f":"IF(übertrag!$H$2=7,VLOOKUP(übertrag!I2,_jhg7,2,),IF($H$2=8,VLOOKUP(übertrag!I2,_jhg8,2,),IF($H$2=9,VLOOKUP(übertrag!I2,_jhg9,2,),IF($H$2=10,VLOOKUP(übertrag!I2,_jhg10,2,),IF($H$2=11,VLOOKUP(übertrag!I2,_jhg11,2,),IF($H$2=12,VLOOKUP(übertrag!I2,jhgheim,2,),\"\"))))))","v":""},{"$f":"IF(übertrag!$H$2=1,VLOOKUP(übertrag!I2,paß1,2,),IF($H$2=2,VLOOKUP(übertrag!I2,paß2,2,),IF($H$2=3,VLOOKUP(übertrag!I2,paß3,2,),IF($H$2=4,VLOOKUP(übertrag!I2,paß4,2,),IF($H$2=5,VLOOKUP(übertrag!I2,paß5,2,),IF($H$2=6,VLOOKUP(übertrag!I2,paß6,2,),\"\"))))))","v":107246},{"$f":"IF(übertrag!$H$2=7,VLOOKUP(übertrag!I2,paß7,2,),IF($H$2=8,VLOOKUP(übertrag!I2,paß8,2,),IF($H$2=9,VLOOKUP(übertrag!I2,paß9,2,),IF($H$2=10,VLOOKUP(übertrag!I2,paß10,2,),IF($H$2=11,VLOOKUP(übertrag!I2,paß11,2,),IF($H$2=12,VLOOKUP(übertrag!I2,paßheim,2,),\"\"))))))","v":""},true,false,null,null,1,{"$f":"'MANNSCHAFTEN+SPIELER'!A3","v":"Rot-Weiß Hirschau"},null,null,null,{"$f":"IF(I16,VLOOKUP(übertrag!I16,Heimü,2,),\"\")","v":"Holger Jahn"},null,null,null,null,1]
[13,1,null,13,null,null,null,null,3,null,{"$f":"IF(übertrag!$H$2=1,VLOOKUP(übertrag!I3,einsü,2,),IF($H$2=2,VLOOKUP(übertrag!I3,zweiü,2,),IF($H$2=3,VLOOKUP(übertrag!I3,dreiü,2,),IF($H$2=4,VLOOKUP(übertrag!I3,vierü,2,),IF($H$2=5,VLOOKUP(übertrag!I3,fünfü,2,),IF($H$2=6,VLOOKUP(übertrag!I3,sechsü,2,),\"\"))))))","v":"Marcus Gevatter"},{"$f":"IF(übertrag!$H$2=7,VLOOKUP(übertrag!I3,siebenü,2,),IF($H$2=8,VLOOKUP(übertrag!I3,achtü,2,),IF($H$2=9,VLOOKUP(übertrag!I3,neunü,2,),IF($H$2=10,VLOOKUP(übertrag!I3,zehnü,2,),IF($H$2=11,VLOOKUP(übertrag!I3,elfü,2,),IF($H$2=12,VLOOKUP(übertrag!I3,Heimü,2,),\"\"))))))","v":""},{"$f":"IF(übertrag!$H$2=1,VLOOKUP(übertrag!I3,_jhg1,2,),IF($H$2=2,VLOOKUP(übertrag!I3,_jhg2,2,),IF($H$2=3,VLOOKUP(übertrag!I3,_jhg3,2,),IF($H$2=4,VLOOKUP(übertrag!I3,_jhg4,2,),IF($H$2=5,VLOOKUP(übertrag!I3,_jhg5,2,),IF($H$2=6,VLOOKUP(übertrag!I3,_jhg6,2,),\"\"))))))","v":"04.98"},{"$f":"IF(übertrag!$H$2=7,VLOOKUP(übertrag!I3,_jhg7,2,),IF($H$2=8,VLOOKUP(übertrag!I3,_jhg8,2,),IF($H$2=9,VLOOKUP(übertrag!I3,_jhg9,2,),IF($H$2=10,VLOOKUP(übertrag!I3,_jhg10,2,),IF($H$2=11,VLOOKUP(übertrag!I3,_jhg11,2,),IF($H$2=12,VLOOKUP(übertrag!I3,jhgheim,2,),\"\"))))))","v":""},{"$f":"IF(übertrag!$H$2=1,VLOOKUP(übertrag!I3,paß1,2,),IF($H$2=2,VLOOKUP(übertrag!I3,paß2,2,),IF($H$2=3,VLOOKUP(übertrag!I3,paß3,2,),IF($H$2=4,VLOOKUP(übertrag!I3,paß4,2,),IF($H$2=5,VLOOKUP(übertrag!I3,paß5,2,),IF($H$2=6,VLOOKUP(übertrag!I3,paß6,2,),\"\"))))))","v":16270},{"$f":"IF(übertrag!$H$2=7,VLOOKUP(übertrag!I3,paß7,2,),IF($H$2=8,VLOOKUP(übertrag!I3,paß8,2,),IF($H$2=9,VLOOKUP(übertrag!I3,paß9,2,),IF($H$2=10,VLOOKUP(übertrag!I3,paß10,2,),IF($H$2=11,VLOOKUP(übertrag!I3,paß11,2,),IF($H$2=12,VLOOKUP(übertrag!I3,paßheim,2,),\"\"))))))","v":""},false,false,null,null,2,{"$f":"'MANNSCHAFTEN+SPIELER'!A24","v":"Gastmannschaft 2"},null,null,null,{"$f":"IF(I17,VLOOKUP(übertrag!I17,Heimü,2,),\"\")","v":"Silvan Meinunger"},null,null,null,null,2]
[13,9,9,13,null,null,null,null,4,null,{"$f":"IF(übertrag!$H$2=1,VLOOKUP(übertrag!I4,einsü,2,),IF($H$2=2,VLOOKUP(übertrag!I4,zweiü,2,),IF($H$2=3,VLOOKUP(übertrag!I4,dreiü,2,),IF($H$2=4,VLOOKUP(übertrag!I4,vierü,2,),IF($H$2=5,VLOOKUP(übertrag!I4,fünfü,2,),IF($H$2=6,VLOOKUP(übertrag!I4,sechsü,2,),\"\"))))))","v":"Thomas Immer"},{"$f":"IF(übertrag!$H$2=7,VLOOKUP(übertrag!I4,siebenü,2,),IF($H$2=8,VLOOKUP(übertrag!I4,achtü,2,),IF($H$2=9,VLOOKUP(übertrag!I4,neunü,2,),IF($H$2=10,VLOOKUP(übertrag!I4,zehnü,2,),IF($H$2=11,VLOOKUP(übertrag!I4,elfü,2,),IF($H$2=12,VLOOKUP(übertrag!I4,Heimü,2,),\"\"))))))","v":""},{"$f":"IF(übertrag!$H$2=1,VLOOKUP(übertrag!I4,_jhg1,2,),IF($H$2=2,VLOOKUP(übertrag!I4,_jhg2,2,),IF($H$2=3,VLOOKUP(übertrag!I4,_jhg3,2,),IF($H$2=4,VLOOKUP(übertrag!I4,_jhg4,2,),IF($H$2=5,VLOOKUP(übertrag!I4,_jhg5,2,),IF($H$2=6,VLOOKUP(übertrag!I4,_jhg6,2,),\"\"))))))","v":"07.84"},{"$f":"IF(übertrag!$H$2=7,VLOOKUP(übertrag!I4,_jhg7,2,),IF($H$2=8,VLOOKUP(übertrag!I4,_jhg8,2,),IF($H$2=9,VLOOKUP(übertrag!I4,_jhg9,2,),IF($H$2=10,VLOOKUP(übertrag!I4,_jhg10,2,),IF($H$2=11,VLOOKUP(übertrag!I4,_jhg11,2,),IF($H$2=12,VLOOKUP(übertrag!I4,jhgheim,2,),\"\"))))))","v":""},{"$f":"IF(übertrag!$H$2=1,VLOOKUP(übertrag!I4,paß1,2,),IF($H$2=2,VLOOKUP(übertrag!I4,paß2,2,),IF($H$2=3,VLOOKUP(übertrag!I4,paß3,2,),IF($H$2=4,VLOOKUP(übertrag!I4,paß4,2,),IF($H$2=5,VLOOKUP(übertrag!I4,paß5,2,),IF($H$2=6,VLOOKUP(übertrag!I4,paß6,2,),\"\"))))))","v":107563},{"$f":"IF(übertrag!$H$2=7,VLOOKUP(übertrag!I4,paß7,2,),IF($H$2=8,VLOOKUP(übertrag!I4,paß8,2,),IF($H$2=9,VLOOKUP(übertrag!I4,paß9,2,),IF($H$2=10,VLOOKUP(übertrag!I4,paß10,2,),IF($H$2=11,VLOOKUP(übertrag!I4,paß11,2,),IF($H$2=12,VLOOKUP(übertrag!I4,paßheim,2,),\"\"))))))","v":""},false,null,null,null,3,{"$f":"'MANNSCHAFTEN+SPIELER'!A45","v":"Gastmannschaft 3"},null,null,null,{"$f":"IF(I18,VLOOKUP(übertrag!I18,Heimü,2,),\"\")","v":"Pascal Österling"},null,null,null,null,3]
[13,1,null,13,null,null,null,null,5,null,{"$f":"IF(übertrag!$H$2=1,VLOOKUP(übertrag!I5,einsü,2,),IF($H$2=2,VLOOKUP(übertrag!I5,zweiü,2,),IF($H$2=3,VLOOKUP(übertrag!I5,dreiü,2,),IF($H$2=4,VLOOKUP(übertrag!I5,vierü,2,),IF($H$2=5,VLOOKUP(übertrag!I5,fünfü,2,),IF($H$2=6,VLOOKUP(übertrag!I5,sechsü,2,),\"\"))))))","v":"Manuel Donhauser"},{"$f":"IF(übertrag!$H$2=7,VLOOKUP(übertrag!I5,siebenü,2,),IF($H$2=8,VLOOKUP(übertrag!I5,achtü,2,),IF($H$2=9,VLOOKUP(übertrag!I5,neunü,2,),IF($H$2=10,VLOOKUP(übertrag!I5,zehnü,2,),IF($H$2=11,VLOOKUP(übertrag!I5,elfü,2,),IF($H$2=12,VLOOKUP(übertrag!I5,Heimü,2,),\"\"))))))","v":""},{"$f":"IF(übertrag!$H$2=1,VLOOKUP(übertrag!I5,_jhg1,2,),IF($H$2=2,VLOOKUP(übertrag!I5,_jhg2,2,),IF($H$2=3,VLOOKUP(übertrag!I5,_jhg3,2,),IF($H$2=4,VLOOKUP(übertrag!I5,_jhg4,2,),IF($H$2=5,VLOOKUP(übertrag!I5,_jhg5,2,),IF($H$2=6,VLOOKUP(übertrag!I5,_jhg6,2,),\"\"))))))","v":"09.96"},{"$f":"IF(übertrag!$H$2=7,VLOOKUP(übertrag!I5,_jhg7,2,),IF($H$2=8,VLOOKUP(übertrag!I5,_jhg8,2,),IF($H$2=9,VLOOKUP(übertrag!I5,_jhg9,2,),IF($H$2=10,VLOOKUP(übertrag!I5,_jhg10,2,),IF($H$2=11,VLOOKUP(übertrag!I5,_jhg11,2,),IF($H$2=12,VLOOKUP(übertrag!I5,jhgheim,2,),\"\"))))))","v":""},{"$f":"IF(übertrag!$H$2=1,VLOOKUP(übertrag!I5,paß1,2,),IF($H$2=2,VLOOKUP(übertrag!I5,paß2,2,),IF($H$2=3,VLOOKUP(übertrag!I5,paß3,2,),IF($H$2=4,VLOOKUP(übertrag!I5,paß4,2,),IF($H$2=5,VLOOKUP(übertrag!I5,paß5,2,),IF($H$2=6,VLOOKUP(übertrag!I5,paß6,2,),\"\"))))))","v":107632},{"$f":"IF(übertrag!$H$2=7,VLOOKUP(übertrag!I5,paß7,2,),IF($H$2=8,VLOOKUP(übertrag!I5,paß8,2,),IF($H$2=9,VLOOKUP(übertrag!I5,paß9,2,),IF($H$2=10,VLOOKUP(übertrag!I5,paß10,2,),IF($H$2=11,VLOOKUP(übertrag!I5,paß11,2,),IF($H$2=12,VLOOKUP(übertrag!I5,paßheim,2,),\"\"))))))","v":""},true,null,null,null,4,{"$f":"'MANNSCHAFTEN+SPIELER'!A66","v":"Gastmannschaft 4"},null,null,null,{"$f":"IF(I19,VLOOKUP(übertrag!I19,Heimü,2,),\"\")","v":"Olaf Pfaller"},null,null,null,null,4]
[13,9,9,13,null,null,null,null,6,null,{"$f":"IF(übertrag!$H$2=1,VLOOKUP(übertrag!I6,einsü,2,),IF($H$2=2,VLOOKUP(übertrag!I6,zweiü,2,),IF($H$2=3,VLOOKUP(übertrag!I6,dreiü,2,),IF($H$2=4,VLOOKUP(übertrag!I6,vierü,2,),IF($H$2=5,VLOOKUP(übertrag!I6,fünfü,2,),IF($H$2=6,VLOOKUP(übertrag!I6,sechsü,2,),\"\"))))))","v":"Daniel Rösch"},{"$f":"IF(übertrag!$H$2=7,VLOOKUP(übertrag!I6,siebenü,2,),IF($H$2=8,VLOOKUP(übertrag!I6,achtü,2,),IF($H$2=9,VLOOKUP(übertrag!I6,neunü,2,),IF($H$2=10,VLOOKUP(übertrag!I6,zehnü,2,),IF($H$2=11,VLOOKUP(übertrag!I6,elfü,2,),IF($H$2=12,VLOOKUP(übertrag!I6,Heimü,2,),\"\"))))))","v":""},{"$f":"IF(übertrag!$H$2=1,VLOOKUP(übertrag!I6,_jhg1,2,),IF($H$2=2,VLOOKUP(übertrag!I6,_jhg2,2,),IF($H$2=3,VLOOKUP(übertrag!I6,_jhg3,2,),IF($H$2=4,VLOOKUP(übertrag!I6,_jhg4,2,),IF($H$2=5,VLOOKUP(übertrag!I6,_jhg5,2,),IF($H$2=6,VLOOKUP(übertrag!I6,_jhg6,2,),\"\"))))))","v":"01.91"},{"$f":"IF(übertrag!$H$2=7,VLOOKUP(übertrag!I6,_jhg7,2,),IF($H$2=8,VLOOKUP(übertrag!I6,_jhg8,2,),IF($H$2=9,VLOOKUP(übertrag!I6,_jhg9,2,),IF($H$2=10,VLOOKUP(übertrag!I6,_jhg10,2,),IF($H$2=11,VLOOKUP(übertrag!I6,_jhg11,2,),IF($H$2=12,VLOOKUP(übertrag!I6,jhgheim,2,),\"\"))))))","v":""},{"$f":"IF(übertrag!$H$2=1,VLOOKUP(übertrag!I6,paß1,2,),IF($H$2=2,VLOOKUP(übertrag!I6,paß2,2,),IF($H$2=3,VLOOKUP(übertrag!I6,paß3,2,),IF($H$2=4,VLOOKUP(übertrag!I6,paß4,2,),IF($H$2=5,VLOOKUP(übertrag!I6,paß5,2,),IF($H$2=6,VLOOKUP(übertrag!I6,paß6,2,),\"\"))))))","v":111231},{"$f":"IF(übertrag!$H$2=7,VLOOKUP(übertrag!I6,paß7,2,),IF($H$2=8,VLOOKUP(übertrag!I6,paß8,2,),IF($H$2=9,VLOOKUP(übertrag!I6,paß9,2,),IF($H$2=10,VLOOKUP(übertrag!I6,paß10,2,),IF($H$2=11,VLOOKUP(übertrag!I6,paß11,2,),IF($H$2=12,VLOOKUP(übertrag!I6,paßheim,2,),\"\"))))))","v":""},false,null,null,null,5,{"$f":"'MANNSCHAFTEN+SPIELER'!A87","v":"Gastmannschaft 5"},null,null,null,{"$f":"IF(I20,VLOOKUP(übertrag!I20,Heimü,2,),\"\")","v":"Georg Schropp"},null,null,null,null,5]
[13,1,null,13,null,null,null,null,7,null,{"$f":"IF(übertrag!$H$2=1,VLOOKUP(übertrag!I7,einsü,2,),IF($H$2=2,VLOOKUP(übertrag!I7,zweiü,2,),IF($H$2=3,VLOOKUP(übertrag!I7,dreiü,2,),IF($H$2=4,VLOOKUP(übertrag!I7,vierü,2,),IF($H$2=5,VLOOKUP(übertrag!I7,fünfü,2,),IF($H$2=6,VLOOKUP(übertrag!I7,sechsü,2,),\"\"))))))","v":"Alexander Held"},{"$f":"IF(übertrag!$H$2=7,VLOOKUP(übertrag!I7,siebenü,2,),IF($H$2=8,VLOOKUP(übertrag!I7,achtü,2,),IF($H$2=9,VLOOKUP(übertrag!I7,neunü,2,),IF($H$2=10,VLOOKUP(übertrag!I7,zehnü,2,),IF($H$2=11,VLOOKUP(übertrag!I7,elfü,2,),IF($H$2=12,VLOOKUP(übertrag!I7,Heimü,2,),\"\"))))))","v":""},{"$f":"IF(übertrag!$H$2=1,VLOOKUP(übertrag!I7,_jhg1,2,),IF($H$2=2,VLOOKUP(übertrag!I7,_jhg2,2,),IF($H$2=3,VLOOKUP(übertrag!I7,_jhg3,2,),IF($H$2=4,VLOOKUP(übertrag!I7,_jhg4,2,),IF($H$2=5,VLOOKUP(übertrag!I7,_jhg5,2,),IF($H$2=6,VLOOKUP(übertrag!I7,_jhg6,2,),\"\"))))))","v":"07.91"},{"$f":"IF(übertrag!$H$2=7,VLOOKUP(übertrag!I7,_jhg7,2,),IF($H$2=8,VLOOKUP(übertrag!I7,_jhg8,2,),IF($H$2=9,VLOOKUP(übertrag!I7,_jhg9,2,),IF($H$2=10,VLOOKUP(übertrag!I7,_jhg10,2,),IF($H$2=11,VLOOKUP(übertrag!I7,_jhg11,2,),IF($H$2=12,VLOOKUP(übertrag!I7,jhgheim,2,),\"\"))))))","v":""},{"$f":"IF(übertrag!$H$2=1,VLOOKUP(übertrag!I7,paß1,2,),IF($H$2=2,VLOOKUP(übertrag!I7,paß2,2,),IF($H$2=3,VLOOKUP(übertrag!I7,paß3,2,),IF($H$2=4,VLOOKUP(übertrag!I7,paß4,2,),IF($H$2=5,VLOOKUP(übertrag!I7,paß5,2,),IF($H$2=6,VLOOKUP(übertrag!I7,paß6,2,),\"\"))))))","v":113989},{"$f":"IF(übertrag!$H$2=7,VLOOKUP(übertrag!I7,paß7,2,),IF($H$2=8,VLOOKUP(übertrag!I7,paß8,2,),IF($H$2=9,VLOOKUP(übertrag!I7,paß9,2,),IF($H$2=10,VLOOKUP(übertrag!I7,paß10,2,),IF($H$2=11,VLOOKUP(übertrag!I7,paß11,2,),IF($H$2=12,VLOOKUP(übertrag!I7,paßheim,2,),\"\"))))))","v":""},false,null,null,null,6,{"$f":"'MANNSCHAFTEN+SPIELER'!A108","v":"Gastmannschaft 6"},null,null,null,{"$f":"IF(I21,VLOOKUP(übertrag!I21,Heimü,2,),\"\")","v":"Marco Endres"},null,null,null,null,6]
[13,9,9,13,null,null,null,null,1,null,{"$f":"IF(übertrag!$H$2=1,VLOOKUP(übertrag!I8,einsü,2,),IF($H$2=2,VLOOKUP(übertrag!I8,zweiü,2,),IF($H$2=3,VLOOKUP(übertrag!I8,dreiü,2,),IF($H$2=4,VLOOKUP(übertrag!I8,vierü,2,),IF($H$2=5,VLOOKUP(übertrag!I8,fünfü,2,),IF($H$2=6,VLOOKUP(übertrag!I8,sechsü,2,),\"\"))))))","v":0},{"$f":"IF(übertrag!$H$2=7,VLOOKUP(übertrag!I8,siebenü,2,),IF($H$2=8,VLOOKUP(übertrag!I8,achtü,2,),IF($H$2=9,VLOOKUP(übertrag!I8,neunü,2,),IF($H$2=10,VLOOKUP(übertrag!I8,zehnü,2,),IF($H$2=11,VLOOKUP(übertrag!I8,elfü,2,),IF($H$2=12,VLOOKUP(übertrag!I8,Heimü,2,),\"\"))))))","v":""},{"$f":"IF(übertrag!$H$2=1,VLOOKUP(übertrag!I8,_jhg1,2,),IF($H$2=2,VLOOKUP(übertrag!I8,_jhg2,2,),IF($H$2=3,VLOOKUP(übertrag!I8,_jhg3,2,),IF($H$2=4,VLOOKUP(übertrag!I8,_jhg4,2,),IF($H$2=5,VLOOKUP(übertrag!I8,_jhg5,2,),IF($H$2=6,VLOOKUP(übertrag!I8,_jhg6,2,),\"\"))))))","v":0},{"$f":"IF(übertrag!$H$2=7,VLOOKUP(übertrag!I8,_jhg7,2,),IF($H$2=8,VLOOKUP(übertrag!I8,_jhg8,2,),IF($H$2=9,VLOOKUP(übertrag!I8,_jhg9,2,),IF($H$2=10,VLOOKUP(übertrag!I8,_jhg10,2,),IF($H$2=11,VLOOKUP(übertrag!I8,_jhg11,2,),IF($H$2=12,VLOOKUP(übertrag!I8,jhgheim,2,),\"\"))))))","v":""},{"$f":"IF(übertrag!$H$2=1,VLOOKUP(übertrag!I8,paß1,2,),IF($H$2=2,VLOOKUP(übertrag!I8,paß2,2,),IF($H$2=3,VLOOKUP(übertrag!I8,paß3,2,),IF($H$2=4,VLOOKUP(übertrag!I8,paß4,2,),IF($H$2=5,VLOOKUP(übertrag!I8,paß5,2,),IF($H$2=6,VLOOKUP(übertrag!I8,paß6,2,),\"\"))))))","v":0},{"$f":"IF(übertrag!$H$2=7,VLOOKUP(übertrag!I8,paß7,2,),IF($H$2=8,VLOOKUP(übertrag!I8,paß8,2,),IF($H$2=9,VLOOKUP(übertrag!I8,paß9,2,),IF($H$2=10,VLOOKUP(übertrag!I8,paß10,2,),IF($H$2=11,VLOOKUP(übertrag!I8,paß11,2,),IF($H$2=12,VLOOKUP(übertrag!I8,paßheim,2,),\"\"))))))","v":""},false,null,null,null,7,{"$f":"'MANNSCHAFTEN+SPIELER'!A129","v":"Gastmannschaft 7"},null,null,null,{"$f":"IF(I22,VLOOKUP(übertrag!I22,Heimü,2,),\"\")","v":"Andreas Aumüller"},null,null,null,null,7]
{"$rows_left_out":109}