{"text_format":"1","workbook":"xlsx","n_sheets":10,"sheets":["DKB","Einzelergebnisse","MANNSCHAFTEN+SPIELER","Daten","Anleitung","Dialog","Dialog2","Dialog3","übertrag","VBA-Modul"],"not_rendered":{"charts":0,"images":1,"macros":1,"external_links":1,"defined_names":137,"comments":1,"pivot_tables":0},"unopened":[{"sheet":"Dialog","index":5,"reason":"not_a_worksheet"},{"sheet":"Dialog2","index":6,"reason":"not_a_worksheet"},{"sheet":"Dialog3","index":7,"reason":"not_a_worksheet"},{"sheet":"VBA-Modul","index":9,"reason":"part_missing"}],"bounds":{"document_bytes":16777216,"sheet_cells":100000,"rows_first":2000,"rows_last":500,"rows_between":2000,"halvings":0,"cell_chars":16384,"cell_head_chars":4096},"cells_cut":0,"cells_raw":0,"read":"whole","date_system":"1900"}

{"sheet":"DKB","index":0,"n_rows":64,"n_cols":25,"rows_kept":64,"cut":false,"hidden":false,"merged":[[7,3,7,10],[9,7,9,8],[19,7,19,8],[23,7,23,8],[17,10,21,10],[10,10,14,10],[20,1,21,3],[9,1,9,3],[60,2,60,24],[61,0,61,24],[62,0,62,24],[19,15,19,17],[17,15,18,17],[24,15,25,17],[23,15,23,17],[20,15,21,17],[10,1,11,3],[13,1,14,3],[19,1,19,3],[23,1,23,3],[20,7,20,8],[21,7,21,8],[64,19,64,25],[64,2,64,5],[63,2,63,5],[64,6,64,10],[63,11,63,15],[63,19,63,24],[25,7,25,8],[64,11,64,15],[24,10,28,10],[28,7,28,8],[27,7,27,8],[26,7,26,8],[30,15,30,17],[44,15,44,17],[42,7,42,8],[31,7,31,8],[26,1,26,3],[27,1,28,3],[24,7,24,8],[24,1,25,3],[53,4,53,8],[53,18,53,21],[51,21,51,22],[50,21,50,22],[47,1,47,3],[47,15,47,17],[48,1,49,3],[48,15,49,17],[48,7,48,8],[47,7,47,8],[49,7,49,8],[30,21,30,22],[31,10,35,10],[33,15,33,17],[38,10,42,10],[43,21,43,22],[32,21,32,22],[34,1,35,3],[30,1,30,3],[31,1,32,3],[41,1,42,3],[45,1,46,3],[33,1,33,3],[44,1,44,3],[37,1,37,3],[38,1,39,3],[40,1,40,3],[45,24,49,24],[45,10,49,10],[45,15,46,17],[48,21,48,22],[49,21,49,22],[47,21,47,22],[46,21,46,22],[45,21,45,22],[31,24,35,24],[38,24,42,24],[40,15,40,17],[31,15,32,17],[38,15,39,17],[41,15,42,17],[34,15,35,17],[34,21,34,22],[33,21,33,22],[37,15,37,17],[10,24,14,24],[9,15,9,17],[10,21,10,22],[16,15,16,17],[11,21,11,22],[24,24,28,24],[27,15,28,17],[26,15,26,17],[17,21,17,22],[18,21,18,22],[17,24,21,24],[9,21,9,22],[2,15,2,17],[4,15,4,17],[5,13,5,14],[1,13,1,14],[2,21,2,24],[7,17,7,24],[3,13,3,14],[4,13,4,14],[3,15,3,24],[4,21,4,24],[5,15,5,24],[1,15,1,24],[12,1,12,3],[15,7,15,8],[17,7,17,8],[18,7,18,8],[12,7,12,8],[16,7,16,8],[14,7,14,8],[17,1,18,3],[19,21,19,22],[16,1,16,3],[12,21,12,22],[20,21,20,22],[21,21,21,22],[22,21,22,22],[23,21,23,22],[27,21,27,22],[28,21,28,22],[34,7,34,8],[10,7,10,8],[11,7,11,8],[13,7,13,8],[16,21,16,22],[12,15,12,17],[10,15,11,17],[13,15,14,17],[29,21,29,22],[13,21,13,22],[14,21,14,22],[15,21,15,22],[24,21,24,22],[25,21,25,22],[26,21,26,22],[22,7,22,8],[37,21,37,22],[39,21,39,22],[38,21,38,22],[40,21,40,22],[41,21,41,22],[40,7,40,8],[41,7,41,8],[37,7,37,8],[31,21,31,22],[52,11,52,13],[51,7,51,8],[52,7,52,8],[52,21,52,22],[42,21,42,22],[35,21,35,22],[36,21,36,22],[44,21,44,22],[0,6,0,16],[29,7,29,8],[50,7,50,8],[35,7,35,8],[36,7,36,8],[39,7,39,8],[30,7,30,8],[43,7,43,8],[32,7,32,8],[33,7,33,8],[6,11,6,13],[7,11,7,13],[44,7,44,8],[45,7,45,8],[46,7,46,8],[38,7,38,8]]}
[null,null,null,null,null,null,"Spielleiter: Robert Rammler",null,null,null,null,null,null,null,null,null,null,"Spielbericht"]
[null,null,null,null,"Senioren",null,null,null,null,{"$f":"IF(übertrag!Q11=TRUE,\"X\",\"\")","v":""},null,null,null,"Land:",null,"Deutschland"]
["Klubspiel",null,{"$f":"IF(übertrag!Q2=TRUE,\"X\",\"\")","v":"X"},null,"Frauen",null,null,null,null,{"$f":"IF(übertrag!Q6=TRUE,\"X\",\"\")","v":""},null,null,null,"Ort:",null,{"$f":"Daten!B1","v":"Zeil am Main"},null,null,null,null,"Datum:","2022-01-22"]
["Pokalspiel",null,{"$f":"IF(übertrag!Q3=TRUE,\"X\",\"\")","v":""},null,"Männer",null,null,null,null,{"$f":"IF(übertrag!Q5=TRUE,\"X\",\"\")","v":"X"},null,null,null,"Bahnanlage:",null,{"$f":"Daten!C1","v":"Zeiler EssZimmer"}]
["Länderspiel",null,{"$f":"IF(übertrag!Q4=TRUE,\"X\",\"\")","v":""},null,"U 23",null,null,null,null,{"$f":"IF(übertrag!Q7=TRUE,\"X\",\"\")","v":""},null,null,null,"Spielbeginn:",null,"22.01.2022  13.30",null,null,null,null,"Spielende:",44583.712836342595]
[null,null,null,null,"U 18",null,null,null,null,{"$f":"IF(übertrag!Q8=TRUE,\"X\",\"\")","v":""},null,null,null,"Liga/Klasse:",null,"2. BL Mitte"]
[null,null,null,null,null,null,null,null,null,null,null,"Spiel Nr.",null,null,null,null,null,null,null,null,null,null,null,"Spieltag:",{"$f":"IF(übertrag!AE25=23,\"\",übertrag!AE25)","v":14}]
[null,null,"Heimmannschaft:",{"$f":"'MANNSCHAFTEN+SPIELER'!O3","v":"1.SKK Gut Holz Zeil 1"},null,null,null,null,null,null,null,12081,null,null,null,null,"Gastmannschaft:",{"$f":"IF(übertrag!H2,VLOOKUP(übertrag!H2,Gastmannschaft,2,),\"\")","v":"Rot-Weiß Hirschau"}]
[]
["Pa.-Nr./Mo.Ja","Vorname, Name",null,null,"FW","Abr","Volle","Ges",null,"SP","MP",null,null,null,"Pa.-Nr./Mo.Ja","Vorname, Name",null,null,"FW","Abr","Volle","Ges",null,"SP","MP"]
[{"$f":"übertrag!O16","v":120763},{"$f":"übertrag!Z2","v":"Holger Jahn"},null,null,{"$f":"IF(Einzelergebnisse!A5=0,\"\",Einzelergebnisse!E5)","v":1},{"$f":"IF(Einzelergebnisse!D5=0,\"\",Einzelergebnisse!D5)","v":61},{"$f":"IF(Einzelergebnisse!C5=0,\"\",Einzelergebnisse!C5)","v":96},{"$f":"IF(Einzelergebnisse!F5=0,\"\",Einzelergebnisse!F5)","v":157},null,{"$f":"IF(Einzelergebnisse!$A$5=0,\"\",IF(H11=\"\",0,IF(H11=V11,0.5,IF(H11>V11,1,IF(AND(H11>0,V11=\"\"),1,0)))))","v":0},{"$f":"IF(Einzelergebnisse!A5=0,\"\",IF(H11=\"\",0,IF(J16&H16=X16&V16,0.5,IF(J16&H16>X16&V16,1,IF(J16>X16,1,0)))))","v":0},null,null,null,{"$f":"IF(übertrag!O2=\"\",übertrag!P2,übertrag!O2)","v":107246},{"$f":"IF(übertrag!K2=\"\",übertrag!L2,übertrag!K2)","v":"Bastian Baumer"},null,null,{"$f":"IF(Einzelergebnisse!H5=0,\"\",Einzelergebnisse!L5)","v":0},{"$f":"IF(Einzelergebnisse!K5=0,\"\",Einzelergebnisse!K5)","v":72},{"$f":"IF(Einzelergebnisse!J5=0,\"\",Einzelergebnisse!J5)","v":97},{"$f":"IF(Einzelergebnisse!M5=0,\"\",Einzelergebnisse!M5)","v":169},null,{"$f":"IF(Einzelergebnisse!$H$5=0,\"\",IF(V11=\"\",0,IF(V11=H11,0.5,IF(V11>H11,1,IF(AND(V11>0,H11=\"\"),1,0)))))","v":1},{"$f":"IF(Einzelergebnisse!H5=0,\"\",IF(V11=\"\",0,IF(X16&V16=J16&H16,0.5,IF(X16&V16>J16&H16,1,IF(X16>J16,1,0)))))","v":1}]
[{"$f":"übertrag!M16","v":"06.72"},null,null,null,{"$f":"IF(Einzelergebnisse!A5=0,\"\",Einzelergebnisse!E6)","v":0},{"$f":"IF(Einzelergebnisse!D6=0,\"\",Einzelergebnisse!D6)","v":42},{"$f":"IF(Einzelergebnisse!C6=0,\"\",Einzelergebnisse!C6)","v":101},{"$f":"IF(Einzelergebnisse!F6=0,\"\",Einzelergebnisse!F6)","v":143},null,{"$f":"IF(Einzelergebnisse!$A$5=0,\"\",IF(H12=\"\",0,IF(H12=V12,0.5,IF(H12>V12,1,IF(AND(H12>0,V12=\"\"),1,0)))))","v":0},null,null,null,null,{"$f":"IF(übertrag!M2=\"\",übertrag!N2,übertrag!M2)","v":"10.79"},null,null,null,{"$f":"IF(Einzelergebnisse!H5=0,\"\",Einzelergebnisse!L6)","v":0},{"$f":"IF(Einzelergebnisse!K6=0,\"\",Einzelergebnisse!K6)","v":63},{"$f":"IF(Einzelergebnisse!J6=0,\"\",Einzelergebnisse!J6)","v":92},{"$f":"IF(Einzelergebnisse!M6=0,\"\",Einzelergebnisse!M6)","v":155},null,{"$f":"IF(Einzelergebnisse!$H$5=0,\"\",IF(V12=\"\",0,IF(V12=H12,0.5,IF(V12>H12,1,IF(AND(V12>0,H12=\"\"),1,0)))))","v":1}]
["Pa.-Nr./Mo.Ja","Awsp. Vorname, Name",null,null,null,null,null,null,null,null,null,null,null,null,"Pa.-Nr./Mo.Ja","Awsp. Vorname, Name"]
[{"$f":"übertrag!O23","v":0},{"$f":"übertrag!Z9","v":0},null,null,{"$f":"IF(Einzelergebnisse!A5=0,\"\",Einzelergebnisse!E7)","v":0},{"$f":"IF(Einzelergebnisse!D7=0,\"\",Einzelergebnisse!D7)","v":54},{"$f":"IF(Einzelergebnisse!C7=0,\"\",Einzelergebnisse!C7)","v":84},{"$f":"IF(Einzelergebnisse!F7=0,\"\",Einzelergebnisse!F7)","v":138},null,{"$f":"IF(Einzelergebnisse!$A$5=0,\"\",IF(H14=\"\",0,IF(H14=V14,0.5,IF(H14>V14,1,IF(AND(H14>0,V14=\"\"),1,0)))))","v":0},null,null,null,null,{"$f":"IF(übertrag!O8=\"\",übertrag!P8,übertrag!O8)","v":0},{"$f":"IF(übertrag!K8=\"\",übertrag!L8,übertrag!K8)","v":0},null,null,{"$f":"IF(Einzelergebnisse!H5=0,\"\",Einzelergebnisse!L7)","v":0},{"$f":"IF(Einzelergebnisse!K7=0,\"\",Einzelergebnisse!K7)","v":63},{"$f":"IF(Einzelergebnisse!J7=0,\"\",Einzelergebnisse!J7)","v":88},{"$f":"IF(Einzelergebnisse!M7=0,\"\",Einzelergebnisse!M7)","v":151},null,{"$f":"IF(Einzelergebnisse!$H$5=0,\"\",IF(V14=\"\",0,IF(V14=H14,0.5,IF(V14>H14,1,IF(AND(V14>0,H14=\"\"),1,0)))))","v":1}]
[{"$f":"übertrag!M23","v":"00:00:00"},null,null,null,{"$f":"IF(Einzelergebnisse!A5=0,\"\",Einzelergebnisse!E8)","v":1},{"$f":"IF(Einzelergebnisse!D8=0,\"\",Einzelergebnisse!D8)","v":53},{"$f":"IF(Einzelergebnisse!C8=0,\"\",Einzelergebnisse!C8)","v":93},{"$f":"IF(Einzelergebnisse!F8=0,\"\",Einzelergebnisse!F8)","v":146},null,{"$f":"IF(Einzelergebnisse!$A$5=0,\"\",IF(H15=\"\",0,IF(H15=V15,0.5,IF(H15>V15,1,IF(AND(H15>0,V15=\"\"),1,0)))))","v":1},null,null,null,null,{"$f":"IF(übertrag!M8=\"\",übertrag!N8,übertrag!M8)","v":"00:00:00"},null,null,null,{"$f":"IF(Einzelergebnisse!H5=0,\"\",Einzelergebnisse!L8)","v":1},{"$f":"IF(Einzelergebnisse!K8=0,\"\",Einzelergebnisse!K8)","v":35},{"$f":"IF(Einzelergebnisse!J8=0,\"\",Einzelergebnisse!J8)","v":92},{"$f":"IF(Einzelergebnisse!M8=0,\"\",Einzelergebnisse!M8)","v":127},null,{"$f":"IF(Einzelergebnisse!$H$5=0,\"\",IF(V15=\"\",0,IF(V15=H15,0.5,IF(V15>H15,1,IF(AND(V15>0,H15=\"\"),1,0)))))","v":0}]
[null,null,null,null,{"$f":"IF(Einzelergebnisse!A5=0,\"\",SUM(E11:E15))","v":2},{"$f":"IF(Einzelergebnisse!A5=0,\"\",SUM(F11:F15))","v":210},{"$f":"IF(Einzelergebnisse!A5=0,\"\",SUM(G11:G15))","v":374},{"$f":"IF(Einzelergebnisse!A5=0,\"\",SUM(H11:H15))","v":584},null,{"$f":"IF(Einzelergebnisse!A5=0,\"\",SUM(J11:J12,J14:J15))","v":1},null,null,null,null,null,null,null,null,{"$f":"IF(Einzelergebnisse!H5=0,\"\",SUM(S11,S12,S14,S15))","v":1},{"$f":"IF(Einzelergebnisse!H5=0,\"\",SUM(T11,T12,T14,T15))","v":233},{"$f":"IF(Einzelergebnisse!H5=0,\"\",SUM(U11,U12,U14,U15))","v":369},{"$f":"IF(Einzelergebnisse!H5=0,\"\",SUM(V11,V12,V14,V15))","v":602},null,{"$f":"IF(Einzelergebnisse!H5=0,\"\",SUM(X11:X12,X14:X15))","v":3}]
["Pa.-Nr./Mo.Ja","Vorname, Name",null,null,"FW","Abr","Volle","Ges",null,"SP","MP",null,null,null,"Pa.-Nr./Mo.Ja","Vorname, Name",null,null,"FW","Abr","Volle","Ges",null,"SP","MP"]
[{"$f":"übertrag!O17","v":79060},{"$f":"übertrag!Z3","v":"Silvan Meinunger"},null,null,{"$f":"IF(Einzelergebnisse!A13=0,\"\",Einzelergebnisse!E13)","v":0},{"$f":"IF(Einzelergebnisse!D13=0,\"\",Einzelergebnisse!D13)","v":54},{"$f":"IF(Einzelergebnisse!C13=0,\"\",Einzelergebnisse!C13)","v":103},{"$f":"IF(Einzelergebnisse!F13=0,\"\",Einzelergebnisse!F13)","v":157},null,{"$f":"IF(Einzelergebnisse!$A$13=0,\"\",IF(H18=\"\",0,IF(H18=V18,0.5,IF(H18>V18,1,IF(AND(H18>0,V18=\"\"),1,0)))))","v":1},{"$f":"IF(Einzelergebnisse!A13=0,\"\",IF(H18=\"\",0,IF(J23&H23=X23&V23,0.5,IF(J23&H23>X23&V23,1,IF(J23>X23,1,0)))))","v":1},null,null,null,{"$f":"IF(übertrag!O3=\"\",übertrag!P3,übertrag!O3)","v":16270},{"$f":"IF(übertrag!K3=\"\",übertrag!L3,übertrag!K3)","v":"Marcus Gevatter"},null,null,{"$f":"IF(Einzelergebnisse!H13=0,\"\",Einzelergebnisse!L13)","v":1},{"$f":"IF(Einzelergebnisse!K13=0,\"\",Einzelergebnisse!K13)","v":49},{"$f":"IF(Einzelergebnisse!J13=0,\"\",Einzelergebnisse!J13)","v":84},{"$f":"IF(Einzelergebnisse!M13=0,\"\",Einzelergebnisse!M13)","v":133},null,{"$f":"IF(Einzelergebnisse!$H$13=0,\"\",IF(V18=\"\",0,IF(V18=H18,0.5,IF(V18>H18,1,IF(AND(V18>0,H18=\"\"),1,0)))))","v":0},{"$f":"IF(Einzelergebnisse!H13=0,\"\",IF(V18=\"\",0,IF(X23&V23=J23&H23,0.5,IF(X23&V23>J23&H23,1,IF(X23>J23,1,0)))))","v":0}]
[{"$f":"übertrag!M17","v":"10.03"},null,null,null,{"$f":"IF(Einzelergebnisse!A13=0,\"\",Einzelergebnisse!E14)","v":1},{"$f":"IF(Einzelergebnisse!D14=0,\"\",Einzelergebnisse!D14)","v":36},{"$f":"IF(Einzelergebnisse!C14=0,\"\",Einzelergebnisse!C14)","v":96},{"$f":"IF(Einzelergebnisse!F14=0,\"\",Einzelergebnisse!F14)","v":132},null,{"$f":"IF(Einzelergebnisse!$A$13=0,\"\",IF(H19=\"\",0,IF(H19=V19,0.5,IF(H19>V19,1,IF(AND(H19>0,V19=\"\"),1,0)))))","v":0},null,null,null,null,{"$f":"IF(übertrag!M3=\"\",übertrag!N3,übertrag!M3)","v":"04.98"},null,null,null,{"$f":"IF(Einzelergebnisse!H13=0,\"\",Einzelergebnisse!L14)","v":1},{"$f":"IF(Einzelergebnisse!K14=0,\"\",Einzelergebnisse!K14)","v":51},{"$f":"IF(Einzelergebnisse!J14=0,\"\",Einzelergebnisse!J14)","v":90},{"$f":"IF(Einzelergebnisse!M14=0,\"\",Einzelergebnisse!M14)","v":141},null,{"$f":"IF(Einzelergebnisse!$H$13=0,\"\",IF(V19=\"\",0,IF(V19=H19,0.5,IF(V19>H19,1,IF(AND(V19>0,H19=\"\"),1,0)))))","v":1}]
["Pa.-Nr./Mo.Ja","Awsp. Vorname, Name",null,null,null,null,null,null,null,null,null,null,null,null,"Pa.-Nr./Mo.Ja","Awsp. Vorname, Name"]
[{"$f":"übertrag!O24","v":0},{"$f":"übertrag!Z10","v":0},null,null,{"$f":"IF(Einzelergebnisse!A13=0,\"\",Einzelergebnisse!E15)","v":0},{"$f":"IF(Einzelergebnisse!D15=0,\"\",Einzelergebnisse!D15)","v":53},{"$f":"IF(Einzelergebnisse!C15=0,\"\",Einzelergebnisse!C15)","v":103},{"$f":"IF(Einzelergebnisse!F15=0,\"\",Einzelergebnisse!F15)","v":156},null,{"$f":"IF(Einzelergebnisse!$A$13=0,\"\",IF(H21=\"\",0,IF(H21=V21,0.5,IF(H21>V21,1,IF(AND(H21>0,V21=\"\"),1,0)))))","v":0},null,null,null,null,{"$f":"IF(übertrag!O9=\"\",übertrag!P9,übertrag!O9)","v":0},{"$f":"IF(übertrag!K9=\"\",übertrag!L9,übertrag!K9)","v":0},null,null,{"$f":"IF(Einzelergebnisse!H13=0,\"\",Einzelergebnisse!L15)","v":0},{"$f":"IF(Einzelergebnisse!K15=0,\"\",Einzelergebnisse!K15)","v":61},{"$f":"IF(Einzelergebnisse!J15=0,\"\",Einzelergebnisse!J15)","v":98},{"$f":"IF(Einzelergebnisse!M15=0,\"\",Einzelergebnisse!M15)","v":159},null,{"$f":"IF(Einzelergebnisse!$H$13=0,\"\",IF(V21=\"\",0,IF(V21=H21,0.5,IF(V21>H21,1,IF(AND(V21>0,H21=\"\"),1,0)))))","v":1}]
[{"$f":"übertrag!M24","v":"00:00:00"},null,null,null,{"$f":"IF(Einzelergebnisse!A13=0,\"\",Einzelergebnisse!E16)","v":0},{"$f":"IF(Einzelergebnisse!D16=0,\"\",Einzelergebnisse!D16)","v":53},{"$f":"IF(Einzelergebnisse!C16=0,\"\",Einzelergebnisse!C16)","v":98},{"$f":"IF(Einzelergebnisse!F16=0,\"\",Einzelergebnisse!F16)","v":151},null,{"$f":"IF(Einzelergebnisse!$A$13=0,\"\",IF(H22=\"\",0,IF(H22=V22,0.5,IF(H22>V22,1,IF(AND(H22>0,V22=\"\"),1,0)))))","v":1},null,null,null,null,{"$f":"IF(übertrag!M9=\"\",übertrag!N9,übertrag!M9)","v":"00:00:00"},null,null,null,{"$f":"IF(Einzelergebnisse!H13=0,\"\",Einzelergebnisse!L16)","v":1},{"$f":"IF(Einzelergebnisse!K16=0,\"\",Einzelergebnisse!K16)","v":53},{"$f":"IF(Einzelergebnisse!J16=0,\"\",Einzelergebnisse!J16)","v":82},{"$f":"IF(Einzelergebnisse!M16=0,\"\",Einzelergebnisse!M16)","v":135},null,{"$f":"IF(Einzelergebnisse!$H$13=0,\"\",IF(V22=\"\",0,IF(V22=H22,0.5,IF(V22>H22,1,IF(AND(V22>0,H22=\"\"),1,0)))))","v":0}]
[null,null,null,null,{"$f":"IF(Einzelergebnisse!A13=0,\"\",SUM(E18:E22))","v":1},{"$f":"IF(Einzelergebnisse!A13=0,\"\",SUM(F18:F22))","v":196},{"$f":"IF(Einzelergebnisse!A13=0,\"\",SUM(G18:G22))","v":400},{"$f":"IF(Einzelergebnisse!A13=0,\"\",SUM(H18:H22))","v":596},null,{"$f":"IF(Einzelergebnisse!A13=0,\"\",SUM(J18:J19,J21:J22))","v":2},null,null,null,null,null,null,null,null,{"$f":"IF(Einzelergebnisse!H13=0,\"\",SUM(S18,S19,S21,S22))","v":3},{"$f":"IF(Einzelergebnisse!H13=0,\"\",SUM(T18,T19,T21,T22))","v":214},{"$f":"IF(Einzelergebnisse!H13=0,\"\",SUM(U18,U19,U21,U22))","v":354},{"$f":"IF(Einzelergebnisse!H13=0,\"\",SUM(V18,V19,V21,V22))","v":568},null,{"$f":"IF(Einzelergebnisse!H13=0,\"\",SUM(X18:X19,X21:X22))","v":2}]
["Pa.-Nr./Mo.Ja","Vorname, Name",null,null,"FW","Abr","Volle","Ges",null,"SP","MP",null,null,null,"Pa.-Nr./Mo.Ja","Vorname, Name",null,null,"FW","Abr","Volle","Ges",null,"SP","MP"]
[{"$f":"übertrag!O18","v":29339},{"$f":"übertrag!Z4","v":"Pascal Österling"},null,null,{"$f":"IF(Einzelergebnisse!A21=0,\"\",Einzelergebnisse!E21)","v":0},{"$f":"IF(Einzelergebnisse!D21=0,\"\",Einzelergebnisse!D21)","v":50},{"$f":"IF(Einzelergebnisse!C21=0,\"\",Einzelergebnisse!C21)","v":92},{"$f":"IF(Einzelergebnisse!F21=0,\"\",Einzelergebnisse!F21)","v":142},null,{"$f":"IF(Einzelergebnisse!$A$21=0,\"\",IF(H25=\"\",0,IF(H25=V25,0.5,IF(H25>V25,1,IF(AND(H25>0,V25=\"\"),1,0)))))","v":0},{"$f":"IF(Einzelergebnisse!A21=0,\"\",IF(H25=\"\",0,IF(J30&H30=X30&V30,0.5,IF(J30&H30>X30&V30,1,IF(J30>X30,1,0)))))","v":0},null,null,null,{"$f":"IF(übertrag!O4=\"\",übertrag!P4,übertrag!O4)","v":107563},{"$f":"IF(übertrag!K4=\"\",übertrag!L4,übertrag!K4)","v":"Thomas Immer"},null,null,{"$f":"IF(Einzelergebnisse!H21=0,\"\",Einzelergebnisse!L21)","v":0},{"$f":"IF(Einzelergebnisse!K21=0,\"\",Einzelergebnisse!K21)","v":59},{"$f":"IF(Einzelergebnisse!J21=0,\"\",Einzelergebnisse!J21)","v":91},{"$f":"IF(Einzelergebnisse!M21=0,\"\",Einzelergebnisse!M21)","v":150},null,{"$f":"IF(Einzelergebnisse!$H$21=0,\"\",IF(V25=\"\",0,IF(V25=H25,0.5,IF(V25>H25,1,IF(AND(V25>0,H25=\"\"),1,0)))))","v":1},{"$f":"IF(Einzelergebnisse!H21=0,\"\",IF(V25=\"\",0,IF(X30&V30=J30&H30,0.5,IF(X30&V30>J30&H30,1,IF(X30>J30,1,0)))))","v":1}]
[{"$f":"übertrag!M18","v":"06.00"},null,null,null,{"$f":"IF(Einzelergebnisse!A21=0,\"\",Einzelergebnisse!E22)","v":0},{"$f":"IF(Einzelergebnisse!D22=0,\"\",Einzelergebnisse!D22)","v":53},{"$f":"IF(Einzelergebnisse!C22=0,\"\",Einzelergebnisse!C22)","v":99},{"$f":"IF(Einzelergebnisse!F22=0,\"\",Einzelergebnisse!F22)","v":152},null,{"$f":"IF(Einzelergebnisse!$A$21=0,\"\",IF(H26=\"\",0,IF(H26=V26,0.5,IF(H26>V26,1,IF(AND(H26>0,V26=\"\"),1,0)))))","v":1},null,null,null,null,{"$f":"IF(übertrag!M4=\"\",übertrag!N4,übertrag!M4)","v":"07.84"},null,null,null,{"$f":"IF(Einzelergebnisse!H21=0,\"\",Einzelergebnisse!L22)","v":1},{"$f":"IF(Einzelergebnisse!K22=0,\"\",Einzelergebnisse!K22)","v":54},{"$f":"IF(Einzelergebnisse!J22=0,\"\",Einzelergebnisse!J22)","v":96},{"$f":"IF(Einzelergebnisse!M22=0,\"\",Einzelergebnisse!M22)","v":150},null,{"$f":"IF(Einzelergebnisse!$H$21=0,\"\",IF(V26=\"\",0,IF(V26=H26,0.5,IF(V26>H26,1,IF(AND(V26>0,H26=\"\"),1,0)))))","v":0}]
["Pa.-Nr./Mo.Ja","Awsp. Vorname, Name",null,null,null,null,null,null,null,null,null,null,null,null,"Pa.-Nr./Mo.Ja","Awsp. Vorname, Name"]
[{"$f":"übertrag!O25","v":0},{"$f":"übertrag!Z11","v":0},null,null,{"$f":"IF(Einzelergebnisse!A21=0,\"\",Einzelergebnisse!E23)","v":0},{"$f":"IF(Einzelergebnisse!D23=0,\"\",Einzelergebnisse!D23)","v":45},{"$f":"IF(Einzelergebnisse!C23=0,\"\",Einzelergebnisse!C23)","v":79},{"$f":"IF(Einzelergebnisse!F23=0,\"\",Einzelergebnisse!F23)","v":124},null,{"$f":"IF(Einzelergebnisse!$A$21=0,\"\",IF(H28=\"\",0,IF(H28=V28,0.5,IF(H28>V28,1,IF(AND(H28>0,V28=\"\"),1,0)))))","v":0},null,null,null,null,{"$f":"IF(übertrag!O10=\"\",übertrag!P10,übertrag!O10)","v":0},{"$f":"IF(übertrag!K10=\"\",übertrag!L10,übertrag!K10)","v":0},null,null,{"$f":"IF(Einzelergebnisse!H21=0,\"\",Einzelergebnisse!L23)","v":0},{"$f":"IF(Einzelergebnisse!K23=0,\"\",Einzelergebnisse!K23)","v":44},{"$f":"IF(Einzelergebnisse!J23=0,\"\",Einzelergebnisse!J23)","v":100},{"$f":"IF(Einzelergebnisse!M23=0,\"\",Einzelergebnisse!M23)","v":144},null,{"$f":"IF(Einzelergebnisse!$H$21=0,\"\",IF(V28=\"\",0,IF(V28=H28,0.5,IF(V28>H28,1,IF(AND(V28>0,H28=\"\"),1,0)))))","v":1}]
[{"$f":"übertrag!M25","v":"00:00:00"},null,null,null,{"$f":"IF(Einzelergebnisse!A21=0,\"\",Einzelergebnisse!E24)","v":1},{"$f":"IF(Einzelergebnisse!D24=0,\"\",Einzelergebnisse!D24)","v":43},{"$f":"IF(Einzelergebnisse!C24=0,\"\",Einzelergebnisse!C24)","v":91},{"$f":"IF(Einzelergebnisse!F24=0,\"\",Einzelergebnisse!F24)","v":134},null,{"$f":"IF(Einzelergebnisse!$A$21=0,\"\",IF(H29=\"\",0,IF(H29=V29,0.5,IF(H29>V29,1,IF(AND(H29>0,V29=\"\"),1,0)))))","v":0},null,null,null,null,{"$f":"IF(übertrag!M10=\"\",übertrag!N10,übertrag!M10)","v":"00:00:00"},null,null,null,{"$f":"IF(Einzelergebnisse!H21=0,\"\",Einzelergebnisse!L24)","v":0},{"$f":"IF(Einzelergebnisse!K24=0,\"\",Einzelergebnisse!K24)","v":44},{"$f":"IF(Einzelergebnisse!J24=0,\"\",Einzelergebnisse!J24)","v":97},{"$f":"IF(Einzelergebnisse!M24=0,\"\",Einzelergebnisse!M24)","v":141},null,{"$f":"IF(Einzelergebnisse!$H$21=0,\"\",IF(V29=\"\",0,IF(V29=H29,0.5,IF(V29>H29,1,IF(AND(V29>0,H29=\"\"),1,0)))))","v":1}]
[null,null,null,null,{"$f":"IF(Einzelergebnisse!A21=0,\"\",SUM(E25:E29))","v":1},{"$f":"IF(Einzelergebnisse!A21=0,\"\",SUM(F25:F29))","v":191},{"$f":"IF(Einzelergebnisse!A21=0,\"\",SUM(G25:G29))","v":361},{"$f":"IF(Einzelergebnisse!A21=0,\"\",SUM(H25:H29))","v":552},null,{"$f":"IF(Einzelergebnisse!A21=0,\"\",SUM(J25:J26,J28:J29))","v":1},null,null,null,null,null,null,null,null,{"$f":"IF(Einzelergebnisse!H21=0,\"\",SUM(S25,S26,S28,S29))","v":1},{"$f":"IF(Einzelergebnisse!H21=0,\"\",SUM(T25,T26,T28,T29))","v":201},{"$f":"IF(Einzelergebnisse!H21=0,\"\",SUM(U25,U26,U28,U29))","v":384},{"$f":"IF(Einzelergebnisse!H21=0,\"\",SUM(V25,V26,V28,V29))","v":585},null,{"$f":"IF(Einzelergebnisse!H21=0,\"\",SUM(X25:X26,X28:X29))","v":3}]
["Pa.-Nr./Mo.Ja","Vorname, Name",null,null,"FW","Abr","Volle","Ges",null,"SP","MP",null,null,null,"Pa.-Nr./Mo.Ja","Vorname, Name",null,null,"FW","Abr","Volle","Ges",null,"Sp","MP"]
[{"$f":"übertrag!O19","v":120769},{"$f":"übertrag!Z5","v":"Olaf Pfaller"},null,null,{"$f":"IF(Einzelergebnisse!A29=0,\"\",Einzelergebnisse!E29)","v":0},{"$f":"IF(Einzelergebnisse!D29=0,\"\",Einzelergebnisse!D29)","v":45},{"$f":"IF(Einzelergebnisse!C29=0,\"\",Einzelergebnisse!C29)","v":96},{"$f":"IF(Einzelergebnisse!F29=0,\"\",Einzelergebnisse!F29)","v":141},null,{"$f":"IF(Einzelergebnisse!$A$29=0,\"\",IF(H32=\"\",0,IF(H32=V32,0.5,IF(H32>V32,1,IF(AND(H32>0,V32=\"\"),1,0)))))","v":0},{"$f":"IF(Einzelergebnisse!A29=0,\"\",IF(H32=\"\",0,IF(J37&H37=X37&V37,0.5,IF(J37&H37>X37&V37,1,IF(J37>X37,1,0)))))","v":0},null,null,null,{"$f":"IF(übertrag!O5=\"\",übertrag!P5,übertrag!O5)","v":107632},{"$f":"IF(übertrag!K5=\"\",übertrag!L5,übertrag!K5)","v":"Manuel Donhauser"},null,null,{"$f":"IF(Einzelergebnisse!H29=0,\"\",Einzelergebnisse!L29)","v":0},{"$f":"IF(Einzelergebnisse!K29=0,\"\",Einzelergebnisse!K29)","v":59},{"$f":"IF(Einzelergebnisse!J29=0,\"\",Einzelergebnisse!J29)","v":92},{"$f":"IF(Einzelergebnisse!M29=0,\"\",Einzelergebnisse!M29)","v":151},null,{"$f":"IF(Einzelergebnisse!$H$29=0,\"\",IF(V32=\"\",0,IF(V32=H32,0.5,IF(V32>H32,1,IF(AND(V32>0,H32=\"\"),1,0)))))","v":1},{"$f":"IF(Einzelergebnisse!H29=0,\"\",IF(V32=\"\",0,IF(X37&V37=J37&H37,0.5,IF(X37&V37>J37&H37,1,IF(X37>J37,1,0)))))","v":1}]
[{"$f":"übertrag!M19","v":"07.69"},null,null,null,{"$f":"IF(Einzelergebnisse!A29=0,\"\",Einzelergebnisse!E30)","v":0},{"$f":"IF(Einzelergebnisse!D30=0,\"\",Einzelergebnisse!D30)","v":53},{"$f":"IF(Einzelergebnisse!C30=0,\"\",Einzelergebnisse!C30)","v":87},{"$f":"IF(Einzelergebnisse!F30=0,\"\",Einzelergebnisse!F30)","v":140},null,{"$f":"IF(Einzelergebnisse!$A$29=0,\"\",IF(H33=\"\",0,IF(H33=V33,0.5,IF(H33>V33,1,IF(AND(H33>0,V33=\"\"),1,0)))))","v":0},null,null,null,null,{"$f":"IF(übertrag!M5=\"\",übertrag!N5,übertrag!M5)","v":"09.96"},null,null,null,{"$f":"IF(Einzelergebnisse!H29=0,\"\",Einzelergebnisse!L30)","v":0},{"$f":"IF(Einzelergebnisse!K30=0,\"\",Einzelergebnisse!K30)","v":45},{"$f":"IF(Einzelergebnisse!J30=0,\"\",Einzelergebnisse!J30)","v":107},{"$f":"IF(Einzelergebnisse!M30=0,\"\",Einzelergebnisse!M30)","v":152},null,{"$f":"IF(Einzelergebnisse!$H$29=0,\"\",IF(V33=\"\",0,IF(V33=H33,0.5,IF(V33>H33,1,IF(AND(V33>0,H33=\"\"),1,0)))))","v":1}]
["Pa.-Nr./Mo.Ja","Awsp. Vorname, Name",null,null,null,null,null,null,null,null,null,null,null,null,"Pa.-Nr./Mo.Ja","Awsp. Vorname, Name"]
[{"$f":"übertrag!O26","v":0},{"$f":"übertrag!Z12","v":0},null,null,{"$f":"IF(Einzelergebnisse!A29=0,\"\",Einzelergebnisse!E31)","v":0},{"$f":"IF(Einzelergebnisse!D31=0,\"\",Einzelergebnisse!D31)","v":34},{"$f":"IF(Einzelergebnisse!C31=0,\"\",Einzelergebnisse!C31)","v":102},{"$f":"IF(Einzelergebnisse!F31=0,\"\",Einzelergebnisse!F31)","v":136},null,{"$f":"IF(Einzelergebnisse!$A$29=0,\"\",IF(H35=\"\",0,IF(H35=V35,0.5,IF(H35>V35,1,IF(AND(H35>0,V35=\"\"),1,0)))))","v":0},null,null,null,null,{"$f":"IF(übertrag!O11=\"\",übertrag!P11,übertrag!O11)","v":0},{"$f":"IF(übertrag!K11=\"\",übertrag!L11,übertrag!K11)","v":0},null,null,{"$f":"IF(Einzelergebnisse!H29=0,\"\",Einzelergebnisse!L31)","v":0},{"$f":"IF(Einzelergebnisse!K31=0,\"\",Einzelergebnisse!K31)","v":87},{"$f":"IF(Einzelergebnisse!J31=0,\"\",Einzelergebnisse!J31)","v":109},{"$f":"IF(Einzelergebnisse!M31=0,\"\",Einzelergebnisse!M31)","v":196},null,{"$f":"IF(Einzelergebnisse!$H$29=0,\"\",IF(V35=\"\",0,IF(V35=H35,0.5,IF(V35>H35,1,IF(AND(V35>0,H35=\"\"),1,0)))))","v":1}]
[{"$f":"übertrag!M26","v":"00:00:00"},null,null,null,{"$f":"IF(Einzelergebnisse!A29=0,\"\",Einzelergebnisse!E32)","v":0},{"$f":"IF(Einzelergebnisse!D32=0,\"\",Einzelergebnisse!D32)","v":44},{"$f":"IF(Einzelergebnisse!C32=0,\"\",Einzelergebnisse!C32)","v":100},{"$f":"IF(Einzelergebnisse!F32=0,\"\",Einzelergebnisse!F32)","v":144},null,{"$f":"IF(Einzelergebnisse!$A$29=0,\"\",IF(H36=\"\",0,IF(H36=V36,0.5,IF(H36>V36,1,IF(AND(H36>0,V36=\"\"),1,0)))))","v":0},null,null,null,null,{"$f":"IF(übertrag!M11=\"\",übertrag!N11,übertrag!M11)","v":"00:00:00"},null,null,null,{"$f":"IF(Einzelergebnisse!H29=0,\"\",Einzelergebnisse!L32)","v":0},{"$f":"IF(Einzelergebnisse!K32=0,\"\",Einzelergebnisse!K32)","v":60},{"$f":"IF(Einzelergebnisse!J32=0,\"\",Einzelergebnisse!J32)","v":102},{"$f":"IF(Einzelergebnisse!M32=0,\"\",Einzelergebnisse!M32)","v":162},null,{"$f":"IF(Einzelergebnisse!$H$29=0,\"\",IF(V36=\"\",0,IF(V36=H36,0.5,IF(V36>H36,1,IF(AND(V36>0,H36=\"\"),1,0)))))","v":1}]
[null,null,null,null,{"$f":"IF(Einzelergebnisse!A29=0,\"\",SUM(E32:E36))","v":0},{"$f":"IF(Einzelergebnisse!A29=0,\"\",SUM(F32:F36))","v":176},{"$f":"IF(Einzelergebnisse!A29=0,\"\",SUM(G32:G36))","v":385},{"$f":"IF(Einzelergebnisse!A29=0,\"\",SUM(H32:H36))","v":561},null,{"$f":"IF(Einzelergebnisse!A29=0,\"\",SUM(J32:J33,J35:J36))","v":0},null,null,null,null,null,null,null,null,{"$f":"IF(Einzelergebnisse!H29=0,\"\",SUM(S32,S33,S35,S36))","v":0},{"$f":"IF(Einzelergebnisse!H29=0,\"\",SUM(T32,T33,T35,T36))","v":251},{"$f":"IF(Einzelergebnisse!H29=0,\"\",SUM(U32,U33,U35,U36))","v":410},{"$f":"IF(Einzelergebnisse!H29=0,\"\",SUM(V32,V33,V35,V36))","v":661},null,{"$f":"IF(Einzelergebnisse!H29=0,\"\",SUM(X32:X33,X35:X36))","v":4}]
["Pa.-Nr./Mo.Ja","Vorname, Name",null,null,"FW","Abr","Volle","Ges",null,"SP","MP",null,null,null,"Pa.-Nr./Mo.Ja","Vorname, Name",null,null,"FW","Abr","Volle","Ges",null,"SP","MP"]
[{"$f":"übertrag!O20","v":120774},{"$f":"übertrag!Z6","v":"Georg Schropp"},null,null,{"$f":"IF(Einzelergebnisse!A37=0,\"\",Einzelergebnisse!E37)","v":2},{"$f":"IF(Einzelergebnisse!D37=0,\"\",Einzelergebnisse!D37)","v":45},{"$f":"IF(Einzelergebnisse!C37=0,\"\",Einzelergebnisse!C37)","v":90},{"$f":"IF(Einzelergebnisse!F37=0,\"\",Einzelergebnisse!F37)","v":135},null,{"$f":"IF(Einzelergebnisse!$A$37=0,\"\",IF(H39=\"\",0,IF(H39=V39,0.5,IF(H39>V39,1,IF(AND(H39>0,V39=\"\"),1,0)))))","v":0},{"$f":"IF(Einzelergebnisse!A37=0,\"\",IF(H39=\"\",0,IF(J44&H44=X44&V44,0.5,IF(J44&H44>X44&V44,1,IF(J44>X44,1,0)))))","v":0},null,null,null,{"$f":"IF(übertrag!O6=\"\",übertrag!P6,übertrag!O6)","v":111231},{"$f":"IF(übertrag!K6=\"\",übertrag!L6,übertrag!K6)","v":"Daniel Rösch"},null,null,{"$f":"IF(Einzelergebnisse!H37=0,\"\",Einzelergebnisse!L37)","v":1},{"$f":"IF(Einzelergebnisse!K37=0,\"\",Einzelergebnisse!K37)","v":42},{"$f":"IF(Einzelergebnisse!J37=0,\"\",Einzelergebnisse!J37)","v":94},{"$f":"IF(Einzelergebnisse!M37=0,\"\",Einzelergebnisse!M37)","v":136},null,{"$f":"IF(Einzelergebnisse!$H$37=0,\"\",IF(V39=\"\",0,IF(V39=H39,0.5,IF(V39>H39,1,IF(AND(V39>0,H39=\"\"),1,0)))))","v":1},{"$f":"IF(Einzelergebnisse!H37=0,\"\",IF(V39=\"\",0,IF(X44&V44=J44&H44,0.5,IF(X44&V44>J44&H44,1,IF(X44>J44,1,0)))))","v":1}]
[{"$f":"übertrag!M20","v":"07.61"},null,null,null,{"$f":"IF(Einzelergebnisse!A37=0,\"\",Einzelergebnisse!E38)","v":3},{"$f":"IF(Einzelergebnisse!D38=0,\"\",Einzelergebnisse!D38)","v":36},{"$f":"IF(Einzelergebnisse!C38=0,\"\",Einzelergebnisse!C38)","v":87},{"$f":"IF(Einzelergebnisse!F38=0,\"\",Einzelergebnisse!F38)","v":123},null,{"$f":"IF(Einzelergebnisse!$A$37=0,\"\",IF(H40=\"\",0,IF(H40=V40,0.5,IF(H40>V40,1,IF(AND(H40>0,V40=\"\"),1,0)))))","v":0},null,null,null,null,{"$f":"IF(übertrag!M6=\"\",übertrag!N6,übertrag!M6)","v":"01.91"},null,null,null,{"$f":"IF(Einzelergebnisse!H37=0,\"\",Einzelergebnisse!L38)","v":0},{"$f":"IF(Einzelergebnisse!K38=0,\"\",Einzelergebnisse!K38)","v":70},{"$f":"IF(Einzelergebnisse!J38=0,\"\",Einzelergebnisse!J38)","v":92},{"$f":"IF(Einzelergebnisse!M38=0,\"\",Einzelergebnisse!M38)","v":162},null,{"$f":"IF(Einzelergebnisse!$H$37=0,\"\",IF(V40=\"\",0,IF(V40=H40,0.5,IF(V40>H40,1,IF(AND(V40>0,H40=\"\"),1,0)))))","v":1}]
["Pa.-Nr./Mo.Ja","Awsp. Vorname, Name",null,null,null,null,null,null,null,null,null,null,null,null,"Pa.-Nr./Mo.Ja","Awsp. Vorname, Name"]
[{"$f":"übertrag!O27","v":120812},{"$f":"übertrag!Z13","v":"Andreas Aumüller"},null,null,{"$f":"IF(Einzelergebnisse!A37=0,\"\",Einzelergebnisse!E39)","v":1},{"$f":"IF(Einzelergebnisse!D39=0,\"\",Einzelergebnisse!D39)","v":42},{"$f":"IF(Einzelergebnisse!C39=0,\"\",Einzelergebnisse!C39)","v":102},{"$f":"IF(Einzelergebnisse!F39=0,\"\",Einzelergebnisse!F39)","v":144},null,{"$f":"IF(Einzelergebnisse!$A$37=0,\"\",IF(H42=\"\",0,IF(H42=V42,0.5,IF(H42>V42,1,IF(AND(H42>0,V42=\"\"),1,0)))))","v":1},null,null,null,null,{"$f":"IF(übertrag!O12=\"\",übertrag!P12,übertrag!O12)","v":0},{"$f":"IF(übertrag!K12=\"\",übertrag!L12,übertrag!K12)","v":0},null,null,{"$f":"IF(Einzelergebnisse!H37=0,\"\",Einzelergebnisse!L39)","v":0},{"$f":"IF(Einzelergebnisse!K39=0,\"\",Einzelergebnisse!K39)","v":54},{"$f":"IF(Einzelergebnisse!J39=0,\"\",Einzelergebnisse!J39)","v":85},{"$f":"IF(Einzelergebnisse!M39=0,\"\",Einzelergebnisse!M39)","v":139},null,{"$f":"IF(Einzelergebnisse!$H$37=0,\"\",IF(V42=\"\",0,IF(V42=H42,0.5,IF(V42>H42,1,IF(AND(V42>0,H42=\"\"),1,0)))))","v":0}]
[{"$f":"übertrag!M27","v":"07.97"},null,null,null,{"$f":"IF(Einzelergebnisse!A37=0,\"\",Einzelergebnisse!E40)","v":1},{"$f":"IF(Einzelergebnisse!D40=0,\"\",Einzelergebnisse!D40)","v":44},{"$f":"IF(Einzelergebnisse!C40=0,\"\",Einzelergebnisse!C40)","v":79},{"$f":"IF(Einzelergebnisse!F40=0,\"\",Einzelergebnisse!F40)","v":123},null,{"$f":"IF(Einzelergebnisse!$A$37=0,\"\",IF(H43=\"\",0,IF(H43=V43,0.5,IF(H43>V43,1,IF(AND(H43>0,V43=\"\"),1,0)))))","v":0},null,null,null,null,{"$f":"IF(übertrag!M12=\"\",übertrag!N12,übertrag!M12)","v":"00:00:00"},null,null,null,{"$f":"IF(Einzelergebnisse!H37=0,\"\",Einzelergebnisse!L40)","v":0},{"$f":"IF(Einzelergebnisse!K40=0,\"\",Einzelergebnisse!K40)","v":51},{"$f":"IF(Einzelergebnisse!J40=0,\"\",Einzelergebnisse!J40)","v":95},{"$f":"IF(Einzelergebnisse!M40=0,\"\",Einzelergebnisse!M40)","v":146},null,{"$f":"IF(Einzelergebnisse!$H$37=0,\"\",IF(V43=\"\",0,IF(V43=H43,0.5,IF(V43>H43,1,IF(AND(V43>0,H43=\"\"),1,0)))))","v":1}]
[null,null,null,null,{"$f":"IF(Einzelergebnisse!A37=0,\"\",SUM(E39:E43))","v":7},{"$f":"IF(Einzelergebnisse!A37=0,\"\",SUM(F39:F43))","v":167},{"$f":"IF(Einzelergebnisse!A37=0,\"\",SUM(G39:G43))","v":358},{"$f":"IF(Einzelergebnisse!A37=0,\"\",SUM(H39:H43))","v":525},null,{"$f":"IF(Einzelergebnisse!A37=0,\"\",SUM(J39:J40,J42:J43))","v":1},null,null,null,null,null,null,null,null,{"$f":"IF(Einzelergebnisse!H37=0,\"\",SUM(S39,S40,S42,S43))","v":1},{"$f":"IF(Einzelergebnisse!H37=0,\"\",SUM(T39,T40,T42,T43))","v":217},{"$f":"IF(Einzelergebnisse!H37=0,\"\",SUM(U39,U40,U42,U43))","v":366},{"$f":"IF(Einzelergebnisse!H37=0,\"\",SUM(V39,V40,V42,V43))","v":583},null,{"$f":"IF(Einzelergebnisse!H37=0,\"\",SUM(X39:X40,X42:X43))","v":3}]
["Pa.-Nr./Mo.Ja","Vorname, Name",null,null,"FW","Abr","Volle","Ges",null,"SP","MP",null,null,null,"Pa.-Nr./Mo.Ja","Vorname, Name",null,null,"FW","Abr","Volle","Ges",null,"SP","MP"]
[{"$f":"übertrag!O21","v":23647},{"$f":"übertrag!Z7","v":"Marco Endres"},null,null,{"$f":"IF(Einzelergebnisse!A45=0,\"\",Einzelergebnisse!E45)","v":0},{"$f":"IF(Einzelergebnisse!D45=0,\"\",Einzelergebnisse!D45)","v":56},{"$f":"IF(Einzelergebnisse!C45=0,\"\",Einzelergebnisse!C45)","v":96},{"$f":"IF(Einzelergebnisse!F45=0,\"\",Einzelergebnisse!F45)","v":152},null,{"$f":"IF(Einzelergebnisse!$A$45=0,\"\",IF(H46=\"\",0,IF(H46=V46,0.5,IF(H46>V46,1,IF(AND(H46>0,V46=\"\"),1,0)))))","v":1},{"$f":"IF(Einzelergebnisse!A45=0,\"\",IF(H46=\"\",0,IF(J51&H51=X51&V51,0.5,IF(J51&H51>X51&V51,1,IF(J51>X51,1,0)))))","v":1},null,null,null,{"$f":"IF(übertrag!O7=\"\",übertrag!P7,übertrag!O7)","v":113989},{"$f":"IF(übertrag!K7=\"\",übertrag!L7,übertrag!K7)","v":"Alexander Held"},null,null,{"$f":"IF(Einzelergebnisse!H45=0,\"\",Einzelergebnisse!L45)","v":1},{"$f":"IF(Einzelergebnisse!K45=0,\"\",Einzelergebnisse!K45)","v":42},{"$f":"IF(Einzelergebnisse!J45=0,\"\",Einzelergebnisse!J45)","v":85},{"$f":"IF(Einzelergebnisse!M45=0,\"\",Einzelergebnisse!M45)","v":127},null,{"$f":"IF(Einzelergebnisse!$H$45=0,\"\",IF(V46=\"\",0,IF(V46=H46,0.5,IF(V46>H46,1,IF(AND(V46>0,H46=\"\"),1,0)))))","v":0},{"$f":"IF(Einzelergebnisse!H45=0,\"\",IF(V46=\"\",0,IF(X51&V51=J51&H51,0.5,IF(X51&V51>J51&H51,1,IF(X51>J51,1,0)))))","v":0}]
[{"$f":"übertrag!M21","v":"01.98"},null,null,null,{"$f":"IF(Einzelergebnisse!A45=0,\"\",Einzelergebnisse!E46)","v":1},{"$f":"IF(Einzelergebnisse!D46=0,\"\",Einzelergebnisse!D46)","v":36},{"$f":"IF(Einzelergebnisse!C46=0,\"\",Einzelergebnisse!C46)","v":83},{"$f":"IF(Einzelergebnisse!F46=0,\"\",Einzelergebnisse!F46)","v":119},null,{"$f":"IF(Einzelergebnisse!$A$45=0,\"\",IF(H47=\"\",0,IF(H47=V47,0.5,IF(H47>V47,1,IF(AND(H47>0,V47=\"\"),1,0)))))","v":0},null,null,null,null,{"$f":"IF(übertrag!M7=\"\",übertrag!N7,übertrag!M7)","v":"07.91"},null,null,null,{"$f":"IF(Einzelergebnisse!H45=0,\"\",Einzelergebnisse!L46)","v":0},{"$f":"IF(Einzelergebnisse!K46=0,\"\",Einzelergebnisse!K46)","v":45},{"$f":"IF(Einzelergebnisse!J46=0,\"\",Einzelergebnisse!J46)","v":104},{"$f":"IF(Einzelergebnisse!M46=0,\"\",Einzelergebnisse!M46)","v":149},null,{"$f":"IF(Einzelergebnisse!$H$45=0,\"\",IF(V47=\"\",0,IF(V47=H47,0.5,IF(V47>H47,1,IF(AND(V47>0,H47=\"\"),1,0)))))","v":1}]
["Pa.-Nr./Mo.Ja","Awsp. Vorname, Name",null,null,null,null,null,null,null,null,null,null,null,null,"Pa.-Nr./Mo.Ja","Awsp. Vorname, Name"]
[{"$f":"übertrag!O28","v":0},{"$f":"übertrag!Z14","v":0},null,null,{"$f":"IF(Einzelergebnisse!A45=0,\"\",Einzelergebnisse!E47)","v":0},{"$f":"IF(Einzelergebnisse!D47=0,\"\",Einzelergebnisse!D47)","v":52},{"$f":"IF(Einzelergebnisse!C47=0,\"\",Einzelergebnisse!C47)","v":110},{"$f":"IF(Einzelergebnisse!F47=0,\"\",Einzelergebnisse!F47)","v":162},null,{"$f":"IF(Einzelergebnisse!$A$45=0,\"\",IF(H49=\"\",0,IF(H49=V49,0.5,IF(H49>V49,1,IF(AND(H49>0,V49=\"\"),1,0)))))","v":1},null,null,null,null,{"$f":"IF(übertrag!O13=\"\",übertrag!P13,übertrag!O13)","v":0},{"$f":"IF(übertrag!K13=\"\",übertrag!L13,übertrag!K13)","v":0},null,null,{"$f":"IF(Einzelergebnisse!H45=0,\"\",Einzelergebnisse!L47)","v":1},{"$f":"IF(Einzelergebnisse!K47=0,\"\",Einzelergebnisse!K47)","v":53},{"$f":"IF(Einzelergebnisse!J47=0,\"\",Einzelergebnisse!J47)","v":91},{"$f":"IF(Einzelergebnisse!M47=0,\"\",Einzelergebnisse!M47)","v":144},null,{"$f":"IF(Einzelergebnisse!$H$45=0,\"\",IF(V49=\"\",0,IF(V49=H49,0.5,IF(V49>H49,1,IF(AND(V49>0,H49=\"\"),1,0)))))","v":0}]
[{"$f":"übertrag!M28","v":"00:00:00"},null,null,null,{"$f":"IF(Einzelergebnisse!A45=0,\"\",Einzelergebnisse!E48)","v":0},{"$f":"IF(Einzelergebnisse!D48=0,\"\",Einzelergebnisse!D48)","v":63},{"$f":"IF(Einzelergebnisse!C48=0,\"\",Einzelergebnisse!C48)","v":100},{"$f":"IF(Einzelergebnisse!F48=0,\"\",Einzelergebnisse!F48)","v":163},null,{"$f":"IF(Einzelergebnisse!$A$45=0,\"\",IF(H50=\"\",0,IF(H50=V50,0.5,IF(H50>V50,1,IF(AND(H50>0,V50=\"\"),1,0)))))","v":1},null,null,null,null,{"$f":"IF(übertrag!M13=\"\",übertrag!N13,übertrag!M13)","v":"00:00:00"},null,null,null,{"$f":"IF(Einzelergebnisse!H45=0,\"\",Einzelergebnisse!L48)","v":4},{"$f":"IF(Einzelergebnisse!K48=0,\"\",Einzelergebnisse!K48)","v":44},{"$f":"IF(Einzelergebnisse!J48=0,\"\",Einzelergebnisse!J48)","v":91},{"$f":"IF(Einzelergebnisse!M48=0,\"\",Einzelergebnisse!M48)","v":135},null,{"$f":"IF(Einzelergebnisse!$H$45=0,\"\",IF(V50=\"\",0,IF(V50=H50,0.5,IF(V50>H50,1,IF(AND(V50>0,H50=\"\"),1,0)))))","v":0}]
[null,null,null,null,{"$f":"IF(Einzelergebnisse!A45=0,\"\",SUM(E46:E50))","v":1},{"$f":"IF(Einzelergebnisse!A45=0,\"\",SUM(F46:F50))","v":207},{"$f":"IF(Einzelergebnisse!A45=0,\"\",SUM(G46:G50))","v":389},{"$f":"IF(Einzelergebnisse!A45=0,\"\",SUM(H46:H50))","v":596},null,{"$f":"IF(Einzelergebnisse!A45=0,\"\",SUM(J46:J47,J49:J50))","v":3},null,null,null,null,null,null,null,null,{"$f":"IF(Einzelergebnisse!H45=0,\"\",SUM(S46,S47,S49,S50))","v":6},{"$f":"IF(Einzelergebnisse!H45=0,\"\",SUM(T46,T47,T49,T50))","v":184},{"$f":"IF(Einzelergebnisse!H45=0,\"\",SUM(U46,U47,U49,U50))","v":371},{"$f":"IF(Einzelergebnisse!H45=0,\"\",SUM(V46,V47,V49,V50))","v":555},null,{"$f":"IF(Einzelergebnisse!H45=0,\"\",SUM(X46:X47,X49:X50))","v":1}]
[null,null,null,null,"gF","gA","gV","gK",null,"SP","MP",null,null,null,null,null,null,null,"gF","gA","gV","gK",null,"SP","MP"]
[null,null,null,null,{"$f":"IF(Einzelergebnisse!A5=0,\"\",SUM(E16,E23,E30,E37,E44,E51))","v":12},{"$f":"IF(Einzelergebnisse!A5=0,\"\",SUM(F16,F23,F30,F37,F44,F51))","v":1147},{"$f":"IF(Einzelergebnisse!A5=0,\"\",SUM(G16,G23,G30,G37,G44,G51))","v":2267},{"$f":"IF(Einzelergebnisse!A5=0,\"\",SUM(H16,H23,H30,H37,H44,H51))","v":3414},{"$f":"IF(Einzelergebnisse!#REF!=0,\"\",SUM(I16,I23,I37,I30,I44,I51))","v":{"$error":"#REF!"}},{"$f":"IF(Einzelergebnisse!A5=0,\"\",SUM(J16,J23,J30,J37,J44,J51))","v":8},{"$f":"IF(Einzelergebnisse!A5=0,\"\",SUM(K11,K18,K25,K32,K39,K46))","v":2},"Endstand",null,null,null,null,null,null,{"$f":"IF(Einzelergebnisse!H5=0,\"\",SUM(S16,S23,S30,S37,S44,S51))","v":12},{"$f":"IF(Einzelergebnisse!H5=0,\"\",SUM(T16,T23,T30,T37,T44,T51))","v":1300},{"$f":"IF(Einzelergebnisse!H5=0,\"\",SUM(U16,U23,U30,U37,U44,U51))","v":2254},{"$f":"IF(Einzelergebnisse!H5=0,\"\",SUM(V16,V23,V30,V37,V44,V51))","v":3554},null,{"$f":"IF(Einzelergebnisse!H5=0,\"\",SUM(X16,X23,X30,X37,X44,X51))","v":16},{"$f":"IF(Einzelergebnisse!H5=0,\"\",SUM(Y11,Y18,Y25,Y32,Y39,Y46))","v":4}]
[null,null,"Gesamt Kegel",{"$f":"IF(Einzelergebnisse!A5=0,\"\",SUM(H16,H23,H30,H37,H44,H51))","v":3414},"Kegel Punkte",null,null,null,null,{"$f":"IF(Einzelergebnisse!A5=0,\"\",IF(D54=0,0,IF(D54=R54,1,IF(D54>R54,2,0))))","v":0},null,{"$f":"IF(Einzelergebnisse!A5=0,\"\",SUM(K53,J54))","v":2},":",{"$f":"IF(Einzelergebnisse!H5=0,\"\",SUM(X54,Y53))","v":6},null,null,"Gesamt Kegel",{"$f":"IF(Einzelergebnisse!H5=0,\"\",SUM(V16,V23,V30,V37,V44,V51))","v":3554},"Kegel Punkte",null,null,null,null,{"$f":"IF(Einzelergebnisse!H5=0,\"\",IF(R54=0,0,IF(R54=D54,1,IF(R54>D54,2,0))))","v":2}]
[null,null,null,null,null,null,null,null,null,null,"Tabellenpunkte",{"$f":"IF(Einzelergebnisse!A5=0,\"\",IF(L54=0,0,IF(L54=N54,1,IF(L54>N54,2,0))))","v":0},":",{"$f":"IF(Einzelergebnisse!A5=0,\"\",IF(N54=0,0,IF(N54=L54,1,IF(N54>L54,2,0))))","v":2}]
[]
[null,"   1)",null,null,null,null,null,"Bahn/Kugelmaterial in Ordnung",{"$f":"IF(übertrag!Q21=TRUE,\"x\",\"\")","v":"x"},"ja",{"$f":"IF(übertrag!Q9=TRUE,\"x\",\"\")","v":""},"nein",null,null,null,null,null,"4)",null,null,"Verletzung",{"$f":"IF(übertrag!Q24=TRUE,\"x\",\"\")","v":""},"ja",{"$f":"IF(übertrag!Q17=TRUE,\"x\",\"\")","v":"x"},"nein"]
[null,"   2)",null,null,null,null,null,"Pässe in Ordnung",{"$f":"IF(übertrag!Q22=TRUE,\"x\",\"\")","v":"x"},"ja",{"$f":"IF(übertrag!Q10=TRUE,\"x\",\"\")","v":""},"nein",null,null,null,null,null,"5)",null,null,"Verwarnung",{"$f":"IF(übertrag!Q25=TRUE,\"x\",\"\")","v":"x"},"ja",{"$f":"IF(übertrag!Q18=TRUE,\"x\",\"\")","v":"x"},"nein"]
[null,"   3)",null,null,null,null,null,"Protest",{"$f":"IF(übertrag!Q23=TRUE,\"x\",\"\")","v":""},"ja",{"$f":"IF(übertrag!Q16=TRUE,\"x\",\"\")","v":"x"},"nein",null,null,null,null,null,"6)",null,null,"Sonstiges",{"$f":"IF(übertrag!Q26=TRUE,\"x\",\"\")","v":""},"ja",{"$f":"IF(übertrag!Q19=TRUE,\"x\",\"\")","v":"x"},"nein"]
[null,null,null,null,null,null,null,"Schiedsrichter OK",{"$f":"IF(übertrag!Q27=TRUE,\"x\",\"\")","v":"x"},"ja",{"$f":"IF(übertrag!Q28=TRUE,\"x\",\"\")","v":""},"nein",null,null,null,"Anlagen",{"$f":"IF(übertrag!Q20=TRUE,\"x\",\"\")","v":""},null,null,null,"Schiedsrichter OK",{"$f":"IF(übertrag!Q29=TRUE,\"x\",\"\")","v":"x"},"ja",{"$f":"IF(übertrag!Q30=TRUE,\"x\",\"\")","v":""},"nein"]
[null,"Bemerkung zu","Meinunger Silvan 56. Wurf - Übertritt"]
["ab Wurf 61 Aumüller f. Schropp"]
[]
[null,"Heimmannschaft",null,null,null,null,null,null,null,null,"Schiedsrichter","Schmidt Sabine Nr. 776",null,null,null,null,null,null,"Gastmannschaft"]

{"sheet":"Einzelergebnisse","index":1,"n_rows":49,"n_cols":13,"rows_kept":49,"cut":false,"hidden":false,"merged":[[1,7,1,12],[1,0,1,5]]}
[]
[{"$f":"DKB!D8","v":"1.SKK Gut Holz Zeil 1"},null,null,null,null,null,null,{"$f":"DKB!R8","v":"Rot-Weiß Hirschau"}]
[]
["Name","Bahn","Volle","Abr","Fe","Ges",null,"Name","Bahn","Volle","Abr","Fe","Ges"]
[{"$f":"DKB!B11","v":"Holger Jahn"},1,{"$f":"Daten!C5","v":96},{"$f":"Daten!B5","v":61},{"$f":"Daten!A5","v":1},{"$f":"SUM(C5,D5)","v":157},null,{"$f":"DKB!P11","v":"Bastian Baumer"},1,{"$f":"Daten!C47","v":97},{"$f":"Daten!B47","v":72},{"$f":"Daten!A47","v":0},{"$f":"SUM(J5,K5)","v":169}]
[null,2,{"$f":"Daten!C6","v":101},{"$f":"Daten!B6","v":42},{"$f":"Daten!A6","v":0},{"$f":"SUM(C6,D6)","v":143},null,null,2,{"$f":"Daten!C48","v":92},{"$f":"Daten!B48","v":63},{"$f":"Daten!A48","v":0},{"$f":"SUM(J6,K6)","v":155}]
[{"$f":"DKB!B14","v":0},3,{"$f":"Daten!C7","v":84},{"$f":"Daten!B7","v":54},{"$f":"Daten!A7","v":0},{"$f":"SUM(C7,D7)","v":138},null,{"$f":"DKB!P14","v":0},3,{"$f":"Daten!C49","v":88},{"$f":"Daten!B49","v":63},{"$f":"Daten!A49","v":0},{"$f":"SUM(J7,K7)","v":151}]
[null,4,{"$f":"Daten!C8","v":93},{"$f":"Daten!B8","v":53},{"$f":"Daten!A8","v":1},{"$f":"SUM(C8,D8)","v":146},null,null,4,{"$f":"Daten!C50","v":92},{"$f":"Daten!B50","v":35},{"$f":"Daten!A50","v":1},{"$f":"SUM(J8,K8)","v":127}]
[null,null,{"$f":"SUM(C5:C8)","v":374},{"$f":"SUM(D5:D8)","v":210},{"$f":"SUM(E5:E8)","v":2},{"$f":"SUM(F5:F8)","v":584},null,null,null,{"$f":"SUM(J5:J8)","v":369},{"$f":"SUM(K5:K8)","v":233},{"$f":"SUM(L5:L8)","v":1},{"$f":"SUM(M5:M8)","v":602}]
[]
[]
["Name","Bahn","Volle","Abr","Fe","Ges",null,"Name","Bahn","Volle","Abr","Fe","Ges"]
[{"$f":"DKB!B18","v":"Silvan Meinunger"},1,{"$f":"Daten!C10","v":103},{"$f":"Daten!B10","v":54},{"$f":"Daten!A10","v":0},{"$f":"SUM(C13,D13)","v":157},null,{"$f":"DKB!P18","v":"Marcus Gevatter"},1,{"$f":"Daten!C52","v":84},{"$f":"Daten!B52","v":49},{"$f":"Daten!A52","v":1},{"$f":"SUM(J13,K13)","v":133}]
[null,2,{"$f":"Daten!C11","v":96},{"$f":"Daten!B11","v":36},{"$f":"Daten!A11","v":1},{"$f":"SUM(C14,D14)","v":132},null,null,2,{"$f":"Daten!C53","v":90},{"$f":"Daten!B53","v":51},{"$f":"Daten!A53","v":1},{"$f":"SUM(J14,K14)","v":141}]
[{"$f":"DKB!B21","v":0},3,{"$f":"Daten!C12","v":103},{"$f":"Daten!B12","v":53},{"$f":"Daten!A12","v":0},{"$f":"SUM(C15,D15)","v":156},null,{"$f":"DKB!P21","v":0},3,{"$f":"Daten!C54","v":98},{"$f":"Daten!B54","v":61},{"$f":"Daten!A54","v":0},{"$f":"SUM(J15,K15)","v":159}]
[null,4,{"$f":"Daten!C13","v":98},{"$f":"Daten!B13","v":53},{"$f":"Daten!A13","v":0},{"$f":"SUM(C16,D16)","v":151},null,null,4,{"$f":"Daten!C55","v":82},{"$f":"Daten!B55","v":53},{"$f":"Daten!A55","v":1},{"$f":"SUM(J16,K16)","v":135}]
[null,null,{"$f":"SUM(C13:C16)","v":400},{"$f":"SUM(D13:D16)","v":196},{"$f":"SUM(E13:E16)","v":1},{"$f":"SUM(F13:F16)","v":596},null,null,null,{"$f":"SUM(J13:J16)","v":354},{"$f":"SUM(K13:K16)","v":214},{"$f":"SUM(L13:L16)","v":3},{"$f":"SUM(M13:M16)","v":568}]
[]
[]
["Name","Bahn","Volle","Abr","Fe","Ges",null,"Name","Bahn","Volle","Abr","Fe","Ges"]
[{"$f":"DKB!B25","v":"Pascal Österling"},1,{"$f":"Daten!C15","v":92},{"$f":"Daten!B15","v":50},{"$f":"Daten!A15","v":0},{"$f":"SUM(C21,D21)","v":142},null,{"$f":"DKB!P25","v":"Thomas Immer"},1,{"$f":"Daten!C57","v":91},{"$f":"Daten!B57","v":59},{"$f":"Daten!A57","v":0},{"$f":"SUM(J21,K21)","v":150}]
[null,2,{"$f":"Daten!C16","v":99},{"$f":"Daten!B16","v":53},{"$f":"Daten!A16","v":0},{"$f":"SUM(C22,D22)","v":152},null,null,2,{"$f":"Daten!C58","v":96},{"$f":"Daten!B58","v":54},{"$f":"Daten!A58","v":1},{"$f":"SUM(J22,K22)","v":150}]
[{"$f":"DKB!B28","v":0},3,{"$f":"Daten!C17","v":79},{"$f":"Daten!B17","v":45},{"$f":"Daten!A17","v":0},{"$f":"SUM(C23,D23)","v":124},null,{"$f":"DKB!P28","v":0},3,{"$f":"Daten!C59","v":100},{"$f":"Daten!B59","v":44},{"$f":"Daten!A59","v":0},{"$f":"SUM(J23,K23)","v":144}]
[null,4,{"$f":"Daten!C18","v":91},{"$f":"Daten!B18","v":43},{"$f":"Daten!A18","v":1},{"$f":"SUM(C24,D24)","v":134},null,null,4,{"$f":"Daten!C60","v":97},{"$f":"Daten!B60","v":44},{"$f":"Daten!A60","v":0},{"$f":"SUM(J24,K24)","v":141}]
[null,null,{"$f":"SUM(C21:C24)","v":361},{"$f":"SUM(D21:D24)","v":191},{"$f":"SUM(E21:E24)","v":1},{"$f":"SUM(F21:F24)","v":552},null,null,null,{"$f":"SUM(J21:J24)","v":384},{"$f":"SUM(K21:K24)","v":201},{"$f":"SUM(L21:L24)","v":1},{"$f":"SUM(M21:M24)","v":585}]
[]
[]
["Name","Bahn","Volle","Abr","Fe","Ges",null,"Name","Bahn","Volle","Abr","Fe","Ges"]
[{"$f":"DKB!B32","v":"Olaf Pfaller"},1,{"$f":"Daten!C20","v":96},{"$f":"Daten!B20","v":45},{"$f":"Daten!A20","v":0},{"$f":"SUM(C29,D29)","v":141},null,{"$f":"DKB!P32","v":"Manuel Donhauser"},1,{"$f":"Daten!C62","v":92},{"$f":"Daten!B62","v":59},{"$f":"Daten!A62","v":0},{"$f":"SUM(J29,K29)","v":151}]
[null,2,{"$f":"Daten!C21","v":87},{"$f":"Daten!B21","v":53},{"$f":"Daten!A21","v":0},{"$f":"SUM(C30,D30)","v":140},null,null,2,{"$f":"Daten!C63","v":107},{"$f":"Daten!B63","v":45},{"$f":"Daten!A63","v":0},{"$f":"SUM(J30,K30)","v":152}]
[{"$f":"DKB!B35","v":0},3,{"$f":"Daten!C22","v":102},{"$f":"Daten!B22","v":34},{"$f":"Daten!A22","v":0},{"$f":"SUM(C31,D31)","v":136},null,{"$f":"DKB!P35","v":0},3,{"$f":"Daten!C64","v":109},{"$f":"Daten!B64","v":87},{"$f":"Daten!A64","v":0},{"$f":"SUM(J31,K31)","v":196}]
[null,4,{"$f":"Daten!C23","v":100},{"$f":"Daten!B23","v":44},{"$f":"Daten!A23","v":0},{"$f":"SUM(C32,D32)","v":144},null,null,4,{"$f":"Daten!C65","v":102},{"$f":"Daten!B65","v":60},{"$f":"Daten!A65","v":0},{"$f":"SUM(J32,K32)","v":162}]
[null,null,{"$f":"SUM(C29:C32)","v":385},{"$f":"SUM(D29:D32)","v":176},{"$f":"SUM(E29:E32)","v":0},{"$f":"SUM(F29:F32)","v":561},null,null,null,{"$f":"SUM(J29:J32)","v":410},{"$f":"SUM(K29:K32)","v":251},{"$f":"SUM(L29:L32)","v":0},{"$f":"SUM(M29:M32)","v":661}]
[]
[]
["Name","Bahn","Volle","Abr","Fe","Ges",null,"Name","Bahn","Volle","Abr","Fe","Ges"]
[{"$f":"DKB!B39","v":"Georg Schropp"},1,{"$f":"Daten!C25","v":90},{"$f":"Daten!B25","v":45},{"$f":"Daten!A25","v":2},{"$f":"SUM(C37,D37)","v":135},null,{"$f":"DKB!P39","v":"Daniel Rösch"},1,{"$f":"Daten!C67","v":94},{"$f":"Daten!B67","v":42},{"$f":"Daten!A67","v":1},{"$f":"SUM(J37,K37)","v":136}]
[null,2,{"$f":"Daten!C26","v":87},{"$f":"Daten!B26","v":36},{"$f":"Daten!A26","v":3},{"$f":"SUM(C38,D38)","v":123},null,null,2,{"$f":"Daten!C68","v":92},{"$f":"Daten!B68","v":70},{"$f":"Daten!A68","v":0},{"$f":"SUM(J38,K38)","v":162}]
[{"$f":"DKB!B42","v":"Andreas Aumüller"},3,{"$f":"Daten!C27","v":102},{"$f":"Daten!B27","v":42},{"$f":"Daten!A27","v":1},{"$f":"SUM(C39,D39)","v":144},null,{"$f":"DKB!P42","v":0},3,{"$f":"Daten!C69","v":85},{"$f":"Daten!B69","v":54},{"$f":"Daten!A69","v":0},{"$f":"SUM(J39,K39)","v":139}]
[null,4,{"$f":"Daten!C28","v":79},{"$f":"Daten!B28","v":44},{"$f":"Daten!A28","v":1},{"$f":"SUM(C40,D40)","v":123},null,null,4,{"$f":"Daten!C70","v":95},{"$f":"Daten!B70","v":51},{"$f":"Daten!A70","v":0},{"$f":"SUM(J40,K40)","v":146}]
[null,null,{"$f":"SUM(C37:C40)","v":358},{"$f":"SUM(D37:D40)","v":167},{"$f":"SUM(E37:E40)","v":7},{"$f":"SUM(F37:F40)","v":525},null,null,null,{"$f":"SUM(J37:J40)","v":366},{"$f":"SUM(K37:K40)","v":217},{"$f":"SUM(L37:L40)","v":1},{"$f":"SUM(M37:M40)","v":583}]
[]
[]
["Name","Bahn","Volle","Abr","Fe","Ges",null,"Name","Bahn","Volle","Abr","Fe","Ges"]
[{"$f":"DKB!B46","v":"Marco Endres"},1,{"$f":"Daten!C30","v":96},{"$f":"Daten!B30","v":56},{"$f":"Daten!A30","v":0},{"$f":"SUM(C45,D45)","v":152},null,{"$f":"DKB!P46","v":"Alexander Held"},1,{"$f":"Daten!C72","v":85},{"$f":"Daten!B72","v":42},{"$f":"Daten!A72","v":1},{"$f":"SUM(J45,K45)","v":127}]
[null,2,{"$f":"Daten!C31","v":83},{"$f":"Daten!B31","v":36},{"$f":"Daten!A31","v":1},{"$f":"SUM(C46,D46)","v":119},null,null,2,{"$f":"Daten!C73","v":104},{"$f":"Daten!B73","v":45},{"$f":"Daten!A73","v":0},{"$f":"SUM(J46,K46)","v":149}]
[{"$f":"DKB!B49","v":0},3,{"$f":"Daten!C32","v":110},{"$f":"Daten!B32","v":52},{"$f":"Daten!A32","v":0},{"$f":"SUM(C47,D47)","v":162},null,{"$f":"DKB!P49","v":0},3,{"$f":"Daten!C74","v":91},{"$f":"Daten!B74","v":53},{"$f":"Daten!A74","v":1},{"$f":"SUM(J47,K47)","v":144}]
[null,4,{"$f":"Daten!C33","v":100},{"$f":"Daten!B33","v":63},{"$f":"Daten!A33","v":0},{"$f":"SUM(C48,D48)","v":163},null,null,4,{"$f":"Daten!C75","v":91},{"$f":"Daten!B75","v":44},{"$f":"Daten!A75","v":4},{"$f":"SUM(J48,K48)","v":135}]
[null,null,{"$f":"SUM(C45:C48)","v":389},{"$f":"SUM(D45:D48)","v":207},{"$f":"SUM(E45:E48)","v":1},{"$f":"SUM(F45:F48)","v":596},null,null,null,{"$f":"SUM(J45:J48)","v":371},{"$f":"SUM(K45:K48)","v":184},{"$f":"SUM(L45:L48)","v":6},{"$f":"SUM(M45:M48)","v":555}]

{"sheet":"MANNSCHAFTEN+SPIELER","index":2,"n_rows":233,"n_cols":21,"rows_kept":233,"cut":false,"hidden":false,"merged":[[0,14,0,20],[0,0,0,6]]}
["Gastmannschaften",null,null,null,null,null,null,null,null,null,null,null,null,null,"Heimmannschaft"]
["KLUB / Verein",null,"Mon/Jahr",null,"Paß-     Nummer",null,"Vorname, Name",null,null,null,null,null,null,null,"KLUB / Verein",null,"Mon/Jahr",null,"Paß-     Nummer",null,"Vorname, Name"]
[{"$f":"M2_Start","v":"Rot-Weiß Hirschau"},1,null,1,null,1,null,null,null,null,null,null,null,null,{"$f":"M1_Start","v":"1.SKK Gut Holz Zeil 1"},1,null,1,null,1]
[{"$f":"$A$3","v":"Rot-Weiß Hirschau"},2,{"$f":"TEXT(Daten!B46,\"MM.JJ\")","v":"10.79"},2,{"$f":"Daten!C46","v":107246},2,{"$f":"_Sp21","v":"Bastian Baumer"},null,null,null,null,null,null,null,{"$f":"$O$3","v":"1.SKK Gut Holz Zeil 1"},2,{"$f":"TEXT(Daten!B4,\"MM.JJ\")","v":"06.72"},2,{"$f":"Daten!Pass11","v":120763},2,{"$f":"_Sp11","v":"Holger Jahn"}]
["Rot-Weiß Hirschau",3,{"$f":"TEXT(Daten!B51,\"MM.JJ\")","v":"04.98"},3,{"$f":"Daten!C51","v":16270},3,{"$f":"_SP22","v":"Marcus Gevatter"},null,null,null,null,null,null,null,"1.SKK Gut Holz Zeil 1",3,{"$f":"TEXT(Daten!B9,\"MM.JJ\")","v":"10.03"},3,{"$f":"Daten!C9","v":79060},3,{"$f":"_Sp12","v":"Silvan Meinunger"}]
["Rot-Weiß Hirschau",4,{"$f":"TEXT(Daten!B56,\"MM.JJ\")","v":"07.84"},4,{"$f":"Daten!C56","v":107563},4,{"$f":"_Sp23","v":"Thomas Immer"},null,null,null,null,null,null,null,"1.SKK Gut Holz Zeil 1",4,{"$f":"TEXT(Daten!B14,\"MM.JJ\")","v":"06.00"},4,{"$f":"Daten!C14","v":29339},4,{"$f":"_Sp13","v":"Pascal Österling"}]
["Rot-Weiß Hirschau",5,{"$f":"TEXT(Daten!B61,\"MM.JJ\")","v":"09.96"},5,{"$f":"Daten!C61","v":107632},5,{"$f":"_Sp24","v":"Manuel Donhauser"},null,null,null,null,null,null,null,"1.SKK Gut Holz Zeil 1",5,{"$f":"TEXT(Daten!B19,\"MM.JJ\")","v":"07.69"},5,{"$f":"Daten!C19","v":120769},5,{"$f":"_Sp14","v":"Olaf Pfaller"}]
["Rot-Weiß Hirschau",6,{"$f":"TEXT(Daten!B66,\"MM.JJ\")","v":"01.91"},6,{"$f":"Daten!C66","v":111231},6,{"$f":"_Sp25","v":"Daniel Rösch"},null,null,null,null,null,null,null,"1.SKK Gut Holz Zeil 1",6,{"$f":"TEXT(Daten!B24,\"MM.JJ\")","v":"07.61"},6,{"$f":"Daten!C24","v":120774},6,{"$f":"_Sp15","v":"Georg Schropp"}]
["Rot-Weiß Hirschau",7,{"$f":"TEXT(Daten!B71,\"MM.JJ\")","v":"07.91"},7,{"$f":"Daten!C71","v":113989},7,{"$f":"_Sp26","v":"Alexander Held"},null,null,null,null,null,null,null,"1.SKK Gut Holz Zeil 1",7,{"$f":"TEXT(Daten!B29,\"MM.JJ\")","v":"01.98"},7,{"$f":"Daten!C29","v":23647},7,{"$f":"_Sp16","v":"Marco Endres"}]
["Rot-Weiß Hirschau",8,{"$f":"TEXT(Daten!B76,\"MM.JJ\")","v":"09.94"},8,{"$f":"Daten!C76","v":107179},8,{"$f":"_ESP21","v":"Sebastian Plößl"},null,null,null,null,null,null,null,"1.SKK Gut Holz Zeil 1",8,{"$f":"TEXT(Daten!B34,\"MM.JJ\")","v":"07.97"},8,{"$f":"Daten!C34","v":120812},8,{"$f":"_ESP11","v":"Andreas Aumüller"}]
["Rot-Weiß Hirschau",9,{"$f":"TEXT(Daten!B81,\"MM.JJ\")","v":"05.92"},9,{"$f":"Daten!C81","v":122251},9,{"$f":"_ESP22","v":"Michael Plößl"},null,null,null,null,null,null,null,"1.SKK Gut Holz Zeil 1",9,"00:00:00",9,{"$f":"Daten!C39","v":120752},9,{"$f":"_Esp12","v":"Oliver Faber"}]
["Rot-Weiß Hirschau",10,null,10,null,10,null,null,null,null,null,null,null,null,"1.SKK Gut Holz Zeil 1",10,null,10,null,10,"Hager Elke"]
["Rot-Weiß Hirschau",11,null,11,null,11,null,null,null,null,null,null,null,null,"1.SKK Gut Holz Zeil 1",11,null,11,null,11]
["Rot-Weiß Hirschau",12,null,12,null,12,null,null,null,null,null,null,null,null,"1.SKK Gut Holz Zeil 1",12,null,12,null,12]
["Rot-Weiß Hirschau",13,null,13,null,13,null,1,"X",1,"eins",1,1,null,"1.SKK Gut Holz Zeil 1",13,null,13,null,13]
["Rot-Weiß Hirschau",14,null,14,null,14,null,null,null,null,null,null,null,null,"1.SKK Gut Holz Zeil 1",14,null,14,null,14]
["Rot-Weiß Hirschau",15,null,15,null,15,null,null,null,null,null,null,null,null,"1.SKK Gut Holz Zeil 1",15,null,15,null,15]
["Rot-Weiß Hirschau",16,null,16,null,16,null,null,null,null,null,null,null,null,"1.SKK Gut Holz Zeil 1",16,null,16,null,16]
["Rot-Weiß Hirschau",17,null,17,null,17,null,null,null,null,null,null,null,null,"1.SKK Gut Holz Zeil 1",17,null,17,null,17]
["Rot-Weiß Hirschau",18,null,18,null,18,null,null,null,null,null,null,null,null,"1.SKK Gut Holz Zeil 1",18,null,18,null,18]
["Rot-Weiß Hirschau",19,null,19,null,19,null,null,null,null,null,null,null,null,"1.SKK Gut Holz Zeil 1",19,null,19,null,19]
["Rot-Weiß Hirschau",20,null,20,null,20,null,null,null,null,null,null,null,null,"1.SKK Gut Holz Zeil 1",20,null,20,null,20]
["Rot-Weiß Hirschau",21,null,21,null,21,null,null,null,null,null,null,null,null,"1.SKK Gut Holz Zeil 1",21,null,21,null,21]
["Gastmannschaft 2",1,null,1,null,1,null,2,null,2,"zwei",2,2,null,"1.SKK Gut Holz Zeil 1",22,null,22,null,22]
[{"$f":"$A$24","v":"Gastmannschaft 2"},2,null,2,null,2,null,null,null,3,"drei",3,3,null,"1.SKK Gut Holz Zeil 1",23,null,23,null,23]
["Gastmannschaft 2",3,null,3,null,3,null,null,null,4,"vier",4,4,null,"1.SKK Gut Holz Zeil 1",24,null,24,null,24]
["Gastmannschaft 2",4,null,4,null,4,null,null,null,5,"fünf",5,5,null,"1.SKK Gut Holz Zeil 1",25,null,25,null,25]
["Gastmannschaft 2",5,null,5,null,5,null,null,null,6,"sechs",6,6,null,"1.SKK Gut Holz Zeil 1",26,null,26,null,26]
["Gastmannschaft 2",6,null,6,null,6,null,null,null,7,"sieben",7,"E",null,"1.SKK Gut Holz Zeil 1",27,null,27,null,27]
["Gastmannschaft 2",7,null,7,null,7,null,null,null,8,"acht",8,"A",null,"1.SKK Gut Holz Zeil 1",28,null,28,null,28]
["Gastmannschaft 2",8,null,8,null,8,null,null,null,9,"neun",9,null,null,"1.SKK Gut Holz Zeil 1",29,null,29,null,29]
["Gastmannschaft 2",9,null,9,null,9,null,null,null,10,"zehn",null,null,null,"1.SKK Gut Holz Zeil 1",30,null,30,null,30]
["Gastmannschaft 2",10,null,10,null,10,null,null,null,11,"elf",null,null,null,"1.SKK Gut Holz Zeil 1",31,null,31,null,31]
["Gastmannschaft 2",11,null,11,null,11,null,null,null,12,"zwölf",null,null,null,"1.SKK Gut Holz Zeil 1",32,null,32,null,32]
["Gastmannschaft 2",12,null,12,null,12,null,null,null,13,null,null,null,null,"1.SKK Gut Holz Zeil 1",33,null,33,null,33]
["Gastmannschaft 2",13,null,13,null,13,null,null,null,null,null,null,null,null,"1.SKK Gut Holz Zeil 1",34,null,34,null,34]
["Gastmannschaft 2",14,null,14,null,14,null,null,null,null,null,null,null,null,"1.SKK Gut Holz Zeil 1",35,null,35,null,35]
["Gastmannschaft 2",15,null,15,null,15,null,null,null,null,null,null,null,null,"1.SKK Gut Holz Zeil 1",36,null,36,null,36]
["Gastmannschaft 2",16,null,16,null,16,null,null,null,null,null,null,null,null,"1.SKK Gut Holz Zeil 1",37,null,37,null,37]
["Gastmannschaft 2",17,null,17,null,17,null,null,null,null,null,null,null,null,"1.SKK Gut Holz Zeil 1",38,null,38,null,38]
["Gastmannschaft 2",18,null,18,null,18,null,null,null,null,null,null,null,null,"1.SKK Gut Holz Zeil 1",39,null,39,null,39]
["Gastmannschaft 2",19,null,19,null,19,null,null,null,null,null,null,null,null,"1.SKK Gut Holz Zeil 1",40,null,40,null,40]
["Gastmannschaft 2",20,null,20,null,20,null,null,null,null,null,null,null,null,"1.SKK Gut Holz Zeil 1",41,null,41,null,41]
["Gastmannschaft 2",21,null,21,null,21]
["Gastmannschaft 3",1,null,1,null,1]
[{"$f":"$A$45","v":"Gastmannschaft 3"},2,null,2,null,2]
["Gastmannschaft 3",3,null,3,null,3]
["Gastmannschaft 3",4,null,4,null,4]
["Gastmannschaft 3",5,null,5,null,5]
["Gastmannschaft 3",6,null,6,null,6]
["Gastmannschaft 3",7,null,7,null,7]
["Gastmannschaft 3",8,null,8,null,8]
["Gastmannschaft 3",9,null,9,null,9]
["Gastmannschaft 3",10,null,10,null,10]
["Gastmannschaft 3",11,null,11,null,11]
["Gastmannschaft 3",12,null,12,null,12]
["Gastmannschaft 3",13,null,13,null,13]
["Gastmannschaft 3",14,null,14,null,14]
["Gastmannschaft 3",15,null,15,null,15]
["Gastmannschaft 3",16,null,16,null,16]
["Gastmannschaft 3",17,null,17,null,17]
["Gastmannschaft 3",18,null,18,null,18]
["Gastmannschaft 3",19,null,19,null,19]
["Gastmannschaft 3",20,null,20,null,20]
["Gastmannschaft 3",21,null,21,null,21]
["Gastmannschaft 4",1,null,1,null,1]
[{"$f":"$A$66","v":"Gastmannschaft 4"},2,null,2,null,2]
["Gastmannschaft 4",3,null,3,null,3]
["Gastmannschaft 4",4,null,4,null,4]
["Gastmannschaft 4",5,null,5,null,5]
["Gastmannschaft 4",6,null,6,null,6]
["Gastmannschaft 4",7,null,7,null,7]
["Gastmannschaft 4",8,null,8,null,8]
["Gastmannschaft 4",9,null,9,null,9]
["Gastmannschaft 4",10,null,10,null,10]
["Gastmannschaft 4",11,null,11,null,11]
["Gastmannschaft 4",12,null,12,null,12]
["Gastmannschaft 4",13,null,13,null,13]
["Gastmannschaft 4",14,null,14,null,14]
["Gastmannschaft 4",15,null,15,null,15]
["Gastmannschaft 4",16,null,16,null,16]
["Gastmannschaft 4",17,null,17,null,17]
["Gastmannschaft 4",18,null,18,null,18]
["Gastmannschaft 4",19,null,19,null,19]
["Gastmannschaft 4",20,null,20,null,20]
["Gastmannschaft 4",21,null,21,null,21]
["Gastmannschaft 5",1,null,1,null,1]
[{"$f":"$A$87","v":"Gastmannschaft 5"},2,null,2,null,2,null,"Gastmannschaft 05 2","Gastmannschaft 05 3","Gastmannschaft 05 4","Gastmannschaft 05 5","Gastmannschaft 05 6","Gastmannschaft 05 7"]
["Gastmannschaft 5",3,null,3,null,3]
["Gastmannschaft 5",4,null,4,null,4]
["Gastmannschaft 5",5,null,5,null,5]
["Gastmannschaft 5",6,null,6,null,6]
["Gastmannschaft 5",7,null,7,null,7]
["Gastmannschaft 5",8,null,8,null,8]
["Gastmannschaft 5",9,null,9,null,9]
["Gastmannschaft 5",10,null,10,null,10]
["Gastmannschaft 5",11,null,11,null,11]
["Gastmannschaft 5",12,null,12,null,12]
["Gastmannschaft 5",13,null,13,null,13]
["Gastmannschaft 5",14,null,14,null,14]
["Gastmannschaft 5",15,null,15,null,15]
["Gastmannschaft 5",16,null,16,null,16]
["Gastmannschaft 5",17,null,17,null,17]
["Gastmannschaft 5",18,null,18,null,18]
["Gastmannschaft 5",19,null,19,null,19]
["Gastmannschaft 5",20,null,20,null,20]
["Gastmannschaft 5",21,null,21,null,21]
["Gastmannschaft 6",1,null,1,null,1]
[{"$f":"$A$108","v":"Gastmannschaft 6"},2,null,2,null,2]
["Gastmannschaft 6",3,null,3,null,3]
["Gastmannschaft 6",4,null,4,null,4]
["Gastmannschaft 6",5,null,5,null,5]
["Gastmannschaft 6",6,null,6,null,6]
["Gastmannschaft 6",7,null,7,null,7]
["Gastmannschaft 6",8,null,8,null,8]
["Gastmannschaft 6",9,null,9,null,9]
["Gastmannschaft 6",10,null,10,null,10]
["Gastmannschaft 6",11,null,11,null,11]
["Gastmannschaft 6",12,null,12,null,12]
["Gastmannschaft 6",13,null,13,null,13]
["Gastmannschaft 6",14,null,14,null,14]
["Gastmannschaft 6",15,null,15,null,15]
["Gastmannschaft 6",16,null,16,null,16]
["Gastmannschaft 6",17,null,17,null,17]
["Gastmannschaft 6",18,null,18,null,18]
["Gastmannschaft 6",19,null,19,null,19]
["Gastmannschaft 6",20,null,20,null,20]
["Gastmannschaft 6",21,null,21,null,21]
["Gastmannschaft 7",1,null,1,null,1]
[{"$f":"$A$129","v":"Gastmannschaft 7"},2,null,2,null,2]
["Gastmannschaft 7",3,null,3,null,3]
["Gastmannschaft 7",4,null,4,null,4]
["Gastmannschaft 7",5,null,5,null,5]
["Gastmannschaft 7",6,null,6,null,6]
["Gastmannschaft 7",7,null,7,null,7]
["Gastmannschaft 7",8,null,8,null,8]
["Gastmannschaft 7",9,null,9,null,9]
["Gastmannschaft 7",10,null,10,null,10]
["Gastmannschaft 7",11,null,11,null,11]
["Gastmannschaft 7",12,null,12,null,12]
["Gastmannschaft 7",13,null,13,null,13]
["Gastmannschaft 7",14,null,14,null,14]
["Gastmannschaft 7",15,null,15,null,15]
["Gastmannschaft 7",16,null,16,null,16]
["Gastmannschaft 7",17,null,17,null,17]
["Gastmannschaft 7",18,null,18,null,18]
["Gastmannschaft 7",19,null,19,null,19]
["Gastmannschaft 7",20,null,20,null,20]
["Gastmannschaft 7",21,null,21,null,21]
["Gastmannschaft 8",1,null,1,null,1]
[{"$f":"$A$150","v":"Gastmannschaft 8"},2,null,2,null,2]
["Gastmannschaft 8",3,null,3,null,3]
["Gastmannschaft 8",4,null,4,null,4]
["Gastmannschaft 8",5,null,5,null,5]
["Gastmannschaft 8",6,null,6,null,6]
["Gastmannschaft 8",7,null,7,null,7]
["Gastmannschaft 8",8,null,8,null,8]
["Gastmannschaft 8",9,null,9,null,9]
["Gastmannschaft 8",10,null,10,null,10]
["Gastmannschaft 8",11,null,11,null,11]
["Gastmannschaft 8",12,null,12,null,12]
["Gastmannschaft 8",13,null,13,null,13]
["Gastmannschaft 8",14,null,14,null,14]
["Gastmannschaft 8",15,null,15,null,15]
["Gastmannschaft 8",16,null,16,null,16]
["Gastmannschaft 8",17,null,17,null,17]
["Gastmannschaft 8",18,null,18,null,18]
["Gastmannschaft 8",19,null,19,null,19]
["Gastmannschaft 8",20,null,20,null,20]
["Gastmannschaft 8",21,null,21,null,21]
["Gastmannschaft 9",1,null,1,null,1]
[{"$f":"$A$171","v":"Gastmannschaft 9"},2,null,2,null,2]
["Gastmannschaft 9",3,null,3,null,3]
["Gastmannschaft 9",4,null,4,null,4]
["Gastmannschaft 9",5,null,5,null,5]
["Gastmannschaft 9",6,null,6,null,6]
["Gastmannschaft 9",7,null,7,null,7]
["Gastmannschaft 9",8,null,8,null,8]
["Gastmannschaft 9",9,null,9,null,9]
["Gastmannschaft 9",10,null,10,null,10]
["Gastmannschaft 9",11,null,11,null,11]
["Gastmannschaft 9",12,null,12,null,12]
["Gastmannschaft 9",13,null,13,null,13]
["Gastmannschaft 9",14,null,14,null,14]
["Gastmannschaft 9",15,null,15,null,15]
["Gastmannschaft 9",16,null,16,null,16]
["Gastmannschaft 9",17,null,17,null,17]
["Gastmannschaft 9",18,null,18,null,18]
["Gastmannschaft 9",19,null,19,null,19]
["Gastmannschaft 9",20,null,20,null,20]
["Gastmannschaft 9",21,null,21,null,21]
["Gastmannschaft 10",1,null,1,null,1]
[{"$f":"$A$192","v":"Gastmannschaft 10"},2,null,2,null,2]
["Gastmannschaft 10",3,null,3,null,3]
["Gastmannschaft 10",4,null,4,null,4]
["Gastmannschaft 10",5,null,5,null,5]
["Gastmannschaft 10",6,null,6,null,6]
["Gastmannschaft 10",7,null,7,null,7]
["Gastmannschaft 10",8,null,8,null,8]
["Gastmannschaft 10",9,null,9,null,9]
["Gastmannschaft 10",10,null,10,null,10]
["Gastmannschaft 10",11,null,11,null,11]
["Gastmannschaft 10",12,null,12,null,12]
["Gastmannschaft 10",13,null,13,null,13]
["Gastmannschaft 10",14,null,14,null,14]
["Gastmannschaft 10",15,null,15,null,15]
["Gastmannschaft 10",16,null,16,null,16]
["Gastmannschaft 10",17,null,17,null,17]
["Gastmannschaft 10",18,null,18,null,18]
["Gastmannschaft 10",19,null,19,null,19]
["Gastmannschaft 10",20,null,20,null,20]
["Gastmannschaft 10",21,null,21,null,21]
["Gastmannschaft 11",1,null,1,null,1]
[{"$f":"$A$213","v":"Gastmannschaft 11"},2,null,2,null,2]
["Gastmannschaft 11",3,null,3,null,3]
["Gastmannschaft 11",4,null,4,null,4]
["Gastmannschaft 11",5,null,5,null,5]
["Gastmannschaft 11",6,null,6,null,6]
["Gastmannschaft 11",7,null,7,null,7]
["Gastmannschaft 11",8,null,8,null,8]
["Gastmannschaft 11",9,null,9,null,9]
["Gastmannschaft 11",10,null,10,null,10]
["Gastmannschaft 11",11,null,11,null,11]
["Gastmannschaft 11",12,null,12,null,12]
["Gastmannschaft 11",13,null,13,null,13]
["Gastmannschaft 11",14,null,14,null,14]
["Gastmannschaft 11",15,null,15,null,15]
["Gastmannschaft 11",16,null,16,null,16]
["Gastmannschaft 11",17,null,17,null,17]
["Gastmannschaft 11",18,null,18,null,18]
["Gastmannschaft 11",19,null,19,null,19]
["Gastmannschaft 11",20,null,20,null,20]
["Gastmannschaft 11",21,null,21,null,21]

{"sheet":"Daten","index":3,"n_rows":81,"n_cols":18,"rows_kept":81,"cut":false,"hidden":false,"merged":[]}
["Zeil 1 - Hirschau 22.1.22","Zeil am Main","Zeiler EssZimmer",null,0,0,null,null,null,"22.1.2022,  12.59 Uhr","22.1.2022,  17.00 Uhr"]
[]
["1.SKK Gut Holz Zeil 1","Olaf Pfaller",null,0,null,0,720,3414,12,2267,1147,0,0,0,1,59,32,"2"]
["Holger Jahn","06.72",120763,0,2,210,0,0,0,374,584,0,9,10,"1",0,0]
[1,61,96,157,0]
[0,42,101,143,0]
[0,54,84,138,0]
[1,53,93,146,0]
["Silvan Meinunger","25.10.2003",79060,0,1,196,0,0,0,400,596,1,14,5,"2",0,0]
[0,54,103,157,0]
[1,36,96,132,1]
[0,53,103,156,1]
[0,53,98,151,1]
["Pascal Österling","06.00",29339,0,1,191,0,0,0,361,552,0,7,4,"1",0,0]
[0,50,92,142,0]
[0,53,99,152,0]
[0,45,79,124,0]
[1,43,91,134,0]
["Olaf Pfaller","07.69",120769,0,0,176,0,0,0,385,561,0,9,4,"0",0,0]
[0,45,96,141,0]
[0,53,87,140,0]
[0,34,102,136,0]
[0,44,100,144,0]
["Georg Schropp","07.61",120774,0,7,167,0,0,0,358,525,0,5,4,"1",0,0]
[2,45,90,135,0]
[3,36,87,123,0]
[1,42,102,144,0]
[1,44,79,123,0]
["Marco Endres","01.98",23647,0,1,207,0,0,0,389,596,0,15,5,"3",0,0]
[0,56,96,152,0]
[1,36,83,119,0]
[0,52,110,162,0]
[0,63,100,163,0]
["Andreas Aumüller","07.97",120812,0,0,0,0,0,0,0,0,0,0,0,"0",0,0]
[]
[]
[]
[]
["Oliver Faber","1981-04-01",120752,0,0,0,0,0,0,0,0,0,0,0,"0",0,0]
[]
[]
[]
[]
[]
["Rot-Weiß Hirschau",null,null,0,null,0,720,3554,12,2254,1300,0,0,0,0,72,28,"6"]
["Bastian Baumer","10.79",107246,0,1,233,0,0,0,369,602,0,9,3,"3",0,0]
[0,72,97,169,0]
[0,63,92,155,0]
[0,63,88,151,0]
[1,35,92,127,0]
["Marcus Gevatter","04.98",16270,0,3,214,0,0,0,354,568,0,12,7,"2",0,0]
[1,49,84,133,0]
[1,51,90,141,0]
[0,61,98,159,0]
[1,53,82,135,0]
["Thomas Immer","07.84",107563,0,1,201,0,0,0,384,585,0,10,2,"3",0,0]
[0,59,91,150,0]
[1,54,96,150,0]
[0,44,100,144,0]
[0,44,97,141,0]
["Manuel Donhauser","09.96",107632,0,0,251,0,0,0,410,661,0,21,5,"4",0,0]
[0,59,92,151,0]
[0,45,107,152,0]
[0,87,109,196,0]
[0,60,102,162,0]
["Daniel Rösch","01.91",111231,0,1,217,0,0,0,366,583,0,12,4,"3",0,0]
[1,42,94,136,0]
[0,70,92,162,0]
[0,54,85,139,0]
[0,51,95,146,0]
["Alexander Held","07.91",113989,0,6,184,0,0,0,371,555,0,8,7,"1",0,0]
[1,42,85,127,0]
[0,45,104,149,0]
[1,53,91,144,0]
[4,44,91,135,0]
["Sebastian Plößl","09.94",107179,0,0,0,0,0,0,0,0,0,0,0,"0",0,0]
[]
[]
[]
[]
["Michael Plößl","05.92",122251,0,0,0,0,0,0,0,0,0,0,0,"0",0,0]

{"sheet":"Anleitung","index":4,"n_rows":14,"n_cols":2,"rows_kept":14,"cut":false,"hidden":false,"merged":[[0,0,0,1]]}
["Anleitung"]
[]
["1.","Spieldaten aus dem Controlcenter exportieren."]
["2.","Spieldaten in \"Daten\" in Zelle \"A1\" einfügen."]
["3.","Grunddaten in \"DKB\" anpassen:"]
[null," - über Button \"Eingabe\" Angaben eingeben"]
[null," - Ersatzspieler über die Buttons Heim- u. Auswärtsmannschaft zuordnen"]
[null," - Datum, Spielbeginn u. Spielende manuell eingeben"]
[null," - Bemerkungen im dafür vorgesehenen Feld eintippen"]
[]
[]
[null,"Keine Eintragungen in den Tabellenblättern\n\"Einzelergebnisse\" u. \"MANNSCHAFTEN+SPIELER\" machen!"]
[]
[null,"Die Reihenfolge der Tabellenblätter darf nicht verändert werden!"]

{"sheet":"übertrag","index":8,"n_rows":117,"n_cols":31,"rows_kept":117,"cut":false,"hidden":true,"merged":[[0,16,0,17]]}
[null,null,null,null,null,null,null,null,null,null,"Spieler 1 - 6","Spieler 7 - 12","geb.jahr 1 - 6","geb.jahr 7 - 12 - 6","paß.Nr 1 - 6","paß.Nr 7 - 12","Eingane der Kreuze",null,null,null,null,"Gastmannschaft",null,"Heim",null,null,null,null,null,null,"Spieltag"]
[13,9,9,13,null,4,null,1,2,null,{"$f":"IF(übertrag!$H$2=1,VLOOKUP(übertrag!I2,einsü,2,),IF($H$2=2,VLOOKUP(übertrag!I2,zweiü,2,),IF($H$2=3,VLOOKUP(übertrag!I2,dreiü,2,),IF($H$2=4,VLOOKUP(übertrag!I2,vierü,2,),IF($H$2=5,VLOOKUP(übertrag!I2,fünfü,2,),IF($H$2=6,VLOOKUP(übertrag!I2,sechsü,2,),\"\"))))))","v":"Bastian Baumer"},{"$f":"IF(übertrag!$H$2=7,VLOOKUP(übertrag!I2,siebenü,2,),IF($H$2=8,VLOOKUP(übertrag!I2,achtü,2,),IF($H$2=9,VLOOKUP(übertrag!I2,neunü,2,),IF($H$2=10,VLOOKUP(übertrag!I2,zehnü,2,),IF($H$2=11,VLOOKUP(übertrag!I2,elfü,2,),IF($H$2=12,VLOOKUP(übertrag!I2,Heimü,2,),\"\"))))))","v":""},{"$f":"IF(übertrag!$H$2=1,VLOOKUP(übertrag!I2,_jhg1,2,),IF($H$2=2,VLOOKUP(übertrag!I2,_jhg2,2,),IF($H$2=3,VLOOKUP(übertrag!I2,_jhg3,2,),IF($H$2=4,VLOOKUP(übertrag!I2,_jhg4,2,),IF($H$2=5,VLOOKUP(übertrag!I2,_jhg5,2,),IF($H$2=6,VLOOKUP(übertrag!I2,_jhg6,2,),\"\"))))))","v":"10.79"},{"$f":"IF(übertrag!$H$2=7,VLOOKUP(übertrag!I2,_jhg7,2,),IF($H$2=8,VLOOKUP(übertrag!I2,_jhg8,2,),IF($H$2=9,VLOOKUP(übertrag!I2,_jhg9,2,),IF($H$2=10,VLOOKUP(übertrag!I2,_jhg10,2,),IF($H$2=11,VLOOKUP(übertrag!I2,_jhg11,2,),IF($H$2=12,VLOOKUP(übertrag!I2,jhgheim,2,),\"\"))))))","v":""},{"$f":"IF(übertrag!$H$2=1,VLOOKUP(übertrag!I2,paß1,2,),IF($H$2=2,VLOOKUP(übertrag!I2,paß2,2,),IF($H$2=3,VLOOKUP(übertrag!I2,paß3,2,),IF($H$2=4,VLOOKUP(übertrag!I2,paß4,2,),IF($H$2=5,VLOOKUP(übertrag!I2,paß5,2,),IF($H$2=6,VLOOKUP(übertrag!I2,paß6,2,),\"\"))))))","v":107246},{"$f":"IF(übertrag!$H$2=7,VLOOKUP(übertrag!I2,paß7,2,),IF($H$2=8,VLOOKUP(übertrag!I2,paß8,2,),IF($H$2=9,VLOOKUP(übertrag!I2,paß9,2,),IF($H$2=10,VLOOKUP(übertrag!I2,paß10,2,),IF($H$2=11,VLOOKUP(übertrag!I2,paß11,2,),IF($H$2=12,VLOOKUP(übertrag!I2,paßheim,2,),\"\"))))))","v":""},true,false,null,null,1,{"$f":"'MANNSCHAFTEN+SPIELER'!A3","v":"Rot-Weiß Hirschau"},null,null,null,{"$f":"IF(I16,VLOOKUP(übertrag!I16,Heimü,2,),\"\")","v":"Holger Jahn"},null,null,null,null,1]
[13,1,null,13,null,null,null,null,3,null,{"$f":"IF(übertrag!$H$2=1,VLOOKUP(übertrag!I3,einsü,2,),IF($H$2=2,VLOOKUP(übertrag!I3,zweiü,2,),IF($H$2=3,VLOOKUP(übertrag!I3,dreiü,2,),IF($H$2=4,VLOOKUP(übertrag!I3,vierü,2,),IF($H$2=5,VLOOKUP(übertrag!I3,fünfü,2,),IF($H$2=6,VLOOKUP(übertrag!I3,sechsü,2,),\"\"))))))","v":"Marcus Gevatter"},{"$f":"IF(übertrag!$H$2=7,VLOOKUP(übertrag!I3,siebenü,2,),IF($H$2=8,VLOOKUP(übertrag!I3,achtü,2,),IF($H$2=9,VLOOKUP(übertrag!I3,neunü,2,),IF($H$2=10,VLOOKUP(übertrag!I3,zehnü,2,),IF($H$2=11,VLOOKUP(übertrag!I3,elfü,2,),IF($H$2=12,VLOOKUP(übertrag!I3,Heimü,2,),\"\"))))))","v":""},{"$f":"IF(übertrag!$H$2=1,VLOOKUP(übertrag!I3,_jhg1,2,),IF($H$2=2,VLOOKUP(übertrag!I3,_jhg2,2,),IF($H$2=3,VLOOKUP(übertrag!I3,_jhg3,2,),IF($H$2=4,VLOOKUP(übertrag!I3,_jhg4,2,),IF($H$2=5,VLOOKUP(übertrag!I3,_jhg5,2,),IF($H$2=6,VLOOKUP(übertrag!I3,_jhg6,2,),\"\"))))))","v":"04.98"},{"$f":"IF(übertrag!$H$2=7,VLOOKUP(übertrag!I3,_jhg7,2,),IF($H$2=8,VLOOKUP(übertrag!I3,_jhg8,2,),IF($H$2=9,VLOOKUP(übertrag!I3,_jhg9,2,),IF($H$2=10,VLOOKUP(übertrag!I3,_jhg10,2,),IF($H$2=11,VLOOKUP(übertrag!I3,_jhg11,2,),IF($H$2=12,VLOOKUP(übertrag!I3,jhgheim,2,),\"\"))))))","v":""},{"$f":"IF(übertrag!$H$2=1,VLOOKUP(übertrag!I3,paß1,2,),IF($H$2=2,VLOOKUP(übertrag!I3,paß2,2,),IF($H$2=3,VLOOKUP(übertrag!I3,paß3,2,),IF($H$2=4,VLOOKUP(übertrag!I3,paß4,2,),IF($H$2=5,VLOOKUP(übertrag!I3,paß5,2,),IF($H$2=6,VLOOKUP(übertrag!I3,paß6,2,),\"\"))))))","v":16270},{"$f":"IF(übertrag!$H$2=7,VLOOKUP(übertrag!I3,paß7,2,),IF($H$2=8,VLOOKUP(übertrag!I3,paß8,2,),IF($H$2=9,VLOOKUP(übertrag!I3,paß9,2,),IF($H$2=10,VLOOKUP(übertrag!I3,paß10,2,),IF($H$2=11,VLOOKUP(übertrag!I3,paß11,2,),IF($H$2=12,VLOOKUP(übertrag!I3,paßheim,2,),\"\"))))))","v":""},false,false,null,null,2,{"$f":"'MANNSCHAFTEN+SPIELER'!A24","v":"Gastmannschaft 2"},null,null,null,{"$f":"IF(I17,VLOOKUP(übertrag!I17,Heimü,2,),\"\")","v":"Silvan Meinunger"},null,null,null,null,2]
[13,9,9,13,null,null,null,null,4,null,{"$f":"IF(übertrag!$H$2=1,VLOOKUP(übertrag!I4,einsü,2,),IF($H$2=2,VLOOKUP(übertrag!I4,zweiü,2,),IF($H$2=3,VLOOKUP(übertrag!I4,dreiü,2,),IF($H$2=4,VLOOKUP(übertrag!I4,vierü,2,),IF($H$2=5,VLOOKUP(übertrag!I4,fünfü,2,),IF($H$2=6,VLOOKUP(übertrag!I4,sechsü,2,),\"\"))))))","v":"Thomas Immer"},{"$f":"IF(übertrag!$H$2=7,VLOOKUP(übertrag!I4,siebenü,2,),IF($H$2=8,VLOOKUP(übertrag!I4,achtü,2,),IF($H$2=9,VLOOKUP(übertrag!I4,neunü,2,),IF($H$2=10,VLOOKUP(übertrag!I4,zehnü,2,),IF($H$2=11,VLOOKUP(übertrag!I4,elfü,2,),IF($H$2=12,VLOOKUP(übertrag!I4,Heimü,2,),\"\"))))))","v":""},{"$f":"IF(übertrag!$H$2=1,VLOOKUP(übertrag!I4,_jhg1,2,),IF($H$2=2,VLOOKUP(übertrag!I4,_jhg2,2,),IF($H$2=3,VLOOKUP(übertrag!I4,_jhg3,2,),IF($H$2=4,VLOOKUP(übertrag!I4,_jhg4,2,),IF($H$2=5,VLOOKUP(übertrag!I4,_jhg5,2,),IF($H$2=6,VLOOKUP(übertrag!I4,_jhg6,2,),\"\"))))))","v":"07.84"},{"$f":"IF(übertrag!$H$2=7,VLOOKUP(übertrag!I4,_jhg7,2,),IF($H$2=8,VLOOKUP(übertrag!I4,_jhg8,2,),IF($H$2=9,VLOOKUP(übertrag!I4,_jhg9,2,),IF($H$2=10,VLOOKUP(übertrag!I4,_jhg10,2,),IF($H$2=11,VLOOKUP(übertrag!I4,_jhg11,2,),IF($H$2=12,VLOOKUP(übertrag!I4,jhgheim,2,),\"\"))))))","v":""},{"$f":"IF(übertrag!$H$2=1,VLOOKUP(übertrag!I4,paß1,2,),IF($H$2=2,VLOOKUP(übertrag!I4,paß2,2,),IF($H$2=3,VLOOKUP(übertrag!I4,paß3,2,),IF($H$2=4,VLOOKUP(übertrag!I4,paß4,2,),IF($H$2=5,VLOOKUP(übertrag!I4,paß5,2,),IF($H$2=6,VLOOKUP(übertrag!I4,paß6,2,),\"\"))))))","v":107563},{"$f":"IF(übertrag!$H$2=7,VLOOKUP(übertrag!I4,paß7,2,),IF($H$2=8,VLOOKUP(übertrag!I4,paß8,2,),IF($H$2=9,VLOOKUP(übertrag!I4,paß9,2,),IF($H$2=10,VLOOKUP(übertrag!I4,paß10,2,),IF($H$2=11,VLOOKUP(übertrag!I4,paß11,2,),IF($H$2=12,VLOOKUP(übertrag!I4,paßheim,2,),\"\"))))))","v":""},false,null,null,null,3,{"$f":"'MANNSCHAFTEN+SPIELER'!A45","v":"Gastmannschaft 3"},null,null,null,{"$f":"IF(I18,VLOOKUP(übertrag!I18,Heimü,2,),\"\")","v":"Pascal Österling"},null,null,null,null,3]
[13,1,null,13,null,null,null,null,5,null,{"$f":"IF(übertrag!$H$2=1,VLOOKUP(übertrag!I5,einsü,2,),IF($H$2=2,VLOOKUP(übertrag!I5,zweiü,2,),IF($H$2=3,VLOOKUP(übertrag!I5,dreiü,2,),IF($H$2=4,VLOOKUP(übertrag!I5,vierü,2,),IF($H$2=5,VLOOKUP(übertrag!I5,fünfü,2,),IF($H$2=6,VLOOKUP(übertrag!I5,sechsü,2,),\"\"))))))","v":"Manuel Donhauser"},{"$f":"IF(übertrag!$H$2=7,VLOOKUP(übertrag!I5,siebenü,2,),IF($H$2=8,VLOOKUP(übertrag!I5,achtü,2,),IF($H$2=9,VLOOKUP(übertrag!I5,neunü,2,),IF($H$2=10,VLOOKUP(übertrag!I5,zehnü,2,),IF($H$2=11,VLOOKUP(übertrag!I5,elfü,2,),IF($H$2=12,VLOOKUP(übertrag!I5,Heimü,2,),\"\"))))))","v":""},{"$f":"IF(übertrag!$H$2=1,VLOOKUP(übertrag!I5,_jhg1,2,),IF($H$2=2,VLOOKUP(übertrag!I5,_jhg2,2,),IF($H$2=3,VLOOKUP(übertrag!I5,_jhg3,2,),IF($H$2=4,VLOOKUP(übertrag!I5,_jhg4,2,),IF($H$2=5,VLOOKUP(übertrag!I5,_jhg5,2,),IF($H$2=6,VLOOKUP(übertrag!I5,_jhg6,2,),\"\"))))))","v":"09.96"},{"$f":"IF(übertrag!$H$2=7,VLOOKUP(übertrag!I5,_jhg7,2,),IF($H$2=8,VLOOKUP(übertrag!I5,_jhg8,2,),IF($H$2=9,VLOOKUP(übertrag!I5,_jhg9,2,),IF($H$2=10,VLOOKUP(übertrag!I5,_jhg10,2,),IF($H$2=11,VLOOKUP(übertrag!I5,_jhg11,2,),IF($H$2=12,VLOOKUP(übertrag!I5,jhgheim,2,),\"\"))))))","v":""},{"$f":"IF(übertrag!$H$2=1,VLOOKUP(übertrag!I5,paß1,2,),IF($H$2=2,VLOOKUP(übertrag!I5,paß2,2,),IF($H$2=3,VLOOKUP(übertrag!I5,paß3,2,),IF($H$2=4,VLOOKUP(übertrag!I5,paß4,2,),IF($H$2=5,VLOOKUP(übertrag!I5,paß5,2,),IF($H$2=6,VLOOKUP(übertrag!I5,paß6,2,),\"\"))))))","v":107632},{"$f":"IF(übertrag!$H$2=7,VLOOKUP(übertrag!I5,paß7,2,),IF($H$2=8,VLOOKUP(übertrag!I5,paß8,2,),IF($H$2=9,VLOOKUP(übertrag!I5,paß9,2,),IF($H$2=10,VLOOKUP(übertrag!I5,paß10,2,),IF($H$2=11,VLOOKUP(übertrag!I5,paß11,2,),IF($H$2=12,VLOOKUP(übertrag!I5,paßheim,2,),\"\"))))))","v":""},true,null,null,null,4,{"$f":"'MANNSCHAFTEN+SPIELER'!A66","v":"Gastmannschaft 4"},null,null,null,{"$f":"IF(I19,VLOOKUP(übertrag!I19,Heimü,2,),\"\")","v":"Olaf Pfaller"},null,null,null,null,4]
[13,9,9,13,null,null,null,null,6,null,{"$f":"IF(übertrag!$H$2=1,VLOOKUP(übertrag!I6,einsü,2,),IF($H$2=2,VLOOKUP(übertrag!I6,zweiü,2,),IF($H$2=3,VLOOKUP(übertrag!I6,dreiü,2,),IF($H$2=4,VLOOKUP(übertrag!I6,vierü,2,),IF($H$2=5,VLOOKUP(übertrag!I6,fünfü,2,),IF($H$2=6,VLOOKUP(übertrag!I6,sechsü,2,),\"\"))))))","v":"Daniel Rösch"},{"$f":"IF(übertrag!$H$2=7,VLOOKUP(übertrag!I6,siebenü,2,),IF($H$2=8,VLOOKUP(übertrag!I6,achtü,2,),IF($H$2=9,VLOOKUP(übertrag!I6,neunü,2,),IF($H$2=10,VLOOKUP(übertrag!I6,zehnü,2,),IF($H$2=11,VLOOKUP(übertrag!I6,elfü,2,),IF($H$2=12,VLOOKUP(übertrag!I6,Heimü,2,),\"\"))))))","v":""},{"$f":"IF(übertrag!$H$2=1,VLOOKUP(übertrag!I6,_jhg1,2,),IF($H$2=2,VLOOKUP(übertrag!I6,_jhg2,2,),IF($H$2=3,VLOOKUP(übertrag!I6,_jhg3,2,),IF($H$2=4,VLOOKUP(übertrag!I6,_jhg4,2,),IF($H$2=5,VLOOKUP(übertrag!I6,_jhg5,2,),IF($H$2=6,VLOOKUP(übertrag!I6,_jhg6,2,),\"\"))))))","v":"01.91"},{"$f":"IF(übertrag!$H$2=7,VLOOKUP(übertrag!I6,_jhg7,2,),IF($H$2=8,VLOOKUP(übertrag!I6,_jhg8,2,),IF($H$2=9,VLOOKUP(übertrag!I6,_jhg9,2,),IF($H$2=10,VLOOKUP(übertrag!I6,_jhg10,2,),IF($H$2=11,VLOOKUP(übertrag!I6,_jhg11,2,),IF($H$2=12,VLOOKUP(übertrag!I6,jhgheim,2,),\"\"))))))","v":""},{"$f":"IF(übertrag!$H$2=1,VLOOKUP(übertrag!I6,paß1,2,),IF($H$2=2,VLOOKUP(übertrag!I6,paß2,2,),IF($H$2=3,VLOOKUP(übertrag!I6,paß3,2,),IF($H$2=4,VLOOKUP(übertrag!I6,paß4,2,),IF($H$2=5,VLOOKUP(übertrag!I6,paß5,2,),IF($H$2=6,VLOOKUP(übertrag!I6,paß6,2,),\"\"))))))","v":111231},{"$f":"IF(übertrag!$H$2=7,VLOOKUP(übertrag!I6,paß7,2,),IF($H$2=8,VLOOKUP(übertrag!I6,paß8,2,),IF($H$2=9,VLOOKUP(übertrag!I6,paß9,2,),IF($H$2=10,VLOOKUP(übertrag!I6,paß10,2,),IF($H$2=11,VLOOKUP(übertrag!I6,paß11,2,),IF($H$2=12,VLOOKUP(übertrag!I6,paßheim,2,),\"\"))))))","v":""},false,null,null,null,5,{"$f":"'MANNSCHAFTEN+SPIELER'!A87","v":"Gastmannschaft 5"},null,null,null,{"$f":"IF(I20,VLOOKUP(übertrag!I20,Heimü,2,),\"\")","v":"Georg Schropp"},null,null,null,null,5]
[13,1,null,13,null,null,null,null,7,null,{"$f":"IF(übertrag!$H$2=1,VLOOKUP(übertrag!I7,einsü,2,),IF($H$2=2,VLOOKUP(übertrag!I7,zweiü,2,),IF($H$2=3,VLOOKUP(übertrag!I7,dreiü,2,),IF($H$2=4,VLOOKUP(übertrag!I7,vierü,2,),IF($H$2=5,VLOOKUP(übertrag!I7,fünfü,2,),IF($H$2=6,VLOOKUP(übertrag!I7,sechsü,2,),\"\"))))))","v":"Alexander Held"},{"$f":"IF(übertrag!$H$2=7,VLOOKUP(übertrag!I7,siebenü,2,),IF($H$2=8,VLOOKUP(übertrag!I7,achtü,2,),IF($H$2=9,VLOOKUP(übertrag!I7,neunü,2,),IF($H$2=10,VLOOKUP(übertrag!I7,zehnü,2,),IF($H$2=11,VLOOKUP(übertrag!I7,elfü,2,),IF($H$2=12,VLOOKUP(übertrag!I7,Heimü,2,),\"\"))))))","v":""},{"$f":"IF(übertrag!$H$2=1,VLOOKUP(übertrag!I7,_jhg1,2,),IF($H$2=2,VLOOKUP(übertrag!I7,_jhg2,2,),IF($H$2=3,VLOOKUP(übertrag!I7,_jhg3,2,),IF($H$2=4,VLOOKUP(übertrag!I7,_jhg4,2,),IF($H$2=5,VLOOKUP(übertrag!I7,_jhg5,2,),IF($H$2=6,VLOOKUP(übertrag!I7,_jhg6,2,),\"\"))))))","v":"07.91"},{"$f":"IF(übertrag!$H$2=7,VLOOKUP(übertrag!I7,_jhg7,2,),IF($H$2=8,VLOOKUP(übertrag!I7,_jhg8,2,),IF($H$2=9,VLOOKUP(übertrag!I7,_jhg9,2,),IF($H$2=10,VLOOKUP(übertrag!I7,_jhg10,2,),IF($H$2=11,VLOOKUP(übertrag!I7,_jhg11,2,),IF($H$2=12,VLOOKUP(übertrag!I7,jhgheim,2,),\"\"))))))","v":""},{"$f":"IF(übertrag!$H$2=1,VLOOKUP(übertrag!I7,paß1,2,),IF($H$2=2,VLOOKUP(übertrag!I7,paß2,2,),IF($H$2=3,VLOOKUP(übertrag!I7,paß3,2,),IF($H$2=4,VLOOKUP(übertrag!I7,paß4,2,),IF($H$2=5,VLOOKUP(übertrag!I7,paß5,2,),IF($H$2=6,VLOOKUP(übertrag!I7,paß6,2,),\"\"))))))","v":113989},{"$f":"IF(übertrag!$H$2=7,VLOOKUP(übertrag!I7,paß7,2,),IF($H$2=8,VLOOKUP(übertrag!I7,paß8,2,),IF($H$2=9,VLOOKUP(übertrag!I7,paß9,2,),IF($H$2=10,VLOOKUP(übertrag!I7,paß10,2,),IF($H$2=11,VLOOKUP(übertrag!I7,paß11,2,),IF($H$2=12,VLOOKUP(übertrag!I7,paßheim,2,),\"\"))))))","v":""},false,null,null,null,6,{"$f":"'MANNSCHAFTEN+SPIELER'!A108","v":"Gastmannschaft 6"},null,null,null,{"$f":"IF(I21,VLOOKUP(übertrag!I21,Heimü,2,),\"\")","v":"Marco Endres"},null,null,null,null,6]
[13,9,9,13,null,null,null,null,1,null,{"$f":"IF(übertrag!$H$2=1,VLOOKUP(übertrag!I8,einsü,2,),IF($H$2=2,VLOOKUP(übertrag!I8,zweiü,2,),IF($H$2=3,VLOOKUP(übertrag!I8,dreiü,2,),IF($H$2=4,VLOOKUP(übertrag!I8,vierü,2,),IF($H$2=5,VLOOKUP(übertrag!I8,fünfü,2,),IF($H$2=6,VLOOKUP(übertrag!I8,sechsü,2,),\"\"))))))","v":0},{"$f":"IF(übertrag!$H$2=7,VLOOKUP(übertrag!I8,siebenü,2,),IF($H$2=8,VLOOKUP(übertrag!I8,achtü,2,),IF($H$2=9,VLOOKUP(übertrag!I8,neunü,2,),IF($H$2=10,VLOOKUP(übertrag!I8,zehnü,2,),IF($H$2=11,VLOOKUP(übertrag!I8,elfü,2,),IF($H$2=12,VLOOKUP(übertrag!I8,Heimü,2,),\"\"))))))","v":""},{"$f":"IF(übertrag!$H$2=1,VLOOKUP(übertrag!I8,_jhg1,2,),IF($H$2=2,VLOOKUP(übertrag!I8,_jhg2,2,),IF($H$2=3,VLOOKUP(übertrag!I8,_jhg3,2,),IF($H$2=4,VLOOKUP(übertrag!I8,_jhg4,2,),IF($H$2=5,VLOOKUP(übertrag!I8,_jhg5,2,),IF($H$2=6,VLOOKUP(übertrag!I8,_jhg6,2,),\"\"))))))","v":0},{"$f":"IF(übertrag!$H$2=7,VLOOKUP(übertrag!I8,_jhg7,2,),IF($H$2=8,VLOOKUP(übertrag!I8,_jhg8,2,),IF($H$2=9,VLOOKUP(übertrag!I8,_jhg9,2,),IF($H$2=10,VLOOKUP(übertrag!I8,_jhg10,2,),IF($H$2=11,VLOOKUP(übertrag!I8,_jhg11,2,),IF($H$2=12,VLOOKUP(übertrag!I8,jhgheim,2,),\"\"))))))","v":""},{"$f":"IF(übertrag!$H$2=1,VLOOKUP(übertrag!I8,paß1,2,),IF($H$2=2,VLOOKUP(übertrag!I8,paß2,2,),IF($H$2=3,VLOOKUP(übertrag!I8,paß3,2,),IF($H$2=4,VLOOKUP(übertrag!I8,paß4,2,),IF($H$2=5,VLOOKUP(übertrag!I8,paß5,2,),IF($H$2=6,VLOOKUP(übertrag!I8,paß6,2,),\"\"))))))","v":0},{"$f":"IF(übertrag!$H$2=7,VLOOKUP(übertrag!I8,paß7,2,),IF($H$2=8,VLOOKUP(übertrag!I8,paß8,2,),IF($H$2=9,VLOOKUP(übertrag!I8,paß9,2,),IF($H$2=10,VLOOKUP(übertrag!I8,paß10,2,),IF($H$2=11,VLOOKUP(übertrag!I8,paß11,2,),IF($H$2=12,VLOOKUP(übertrag!I8,paßheim,2,),\"\"))))))","v":""},false,null,null,null,7,{"$f":"'MANNSCHAFTEN+SPIELER'!A129","v":"Gastmannschaft 7"},null,null,null,{"$f":"IF(I22,VLOOKUP(übertrag!I22,Heimü,2,),\"\")","v":"Andreas Aumüller"},null,null,null,null,7]
[null,null,null,null,null,null,null,null,1,null,{"$f":"IF(übertrag!$H$2=1,VLOOKUP(übertrag!I9,einsü,2,),IF($H$2=2,VLOOKUP(übertrag!I9,zweiü,2,),IF($H$2=3,VLOOKUP(übertrag!I9,dreiü,2,),IF($H$2=4,VLOOKUP(übertrag!I9,vierü,2,),IF($H$2=5,VLOOKUP(übertrag!I9,fünfü,2,),IF($H$2=6,VLOOKUP(übertrag!I9,sechsü,2,),\"\"))))))","v":0},{"$f":"IF(übertrag!$H$2=7,VLOOKUP(übertrag!I9,siebenü,2,),IF($H$2=8,VLOOKUP(übertrag!I9,achtü,2,),IF($H$2=9,VLOOKUP(übertrag!I9,neunü,2,),IF($H$2=10,VLOOKUP(übertrag!I9,zehnü,2,),IF($H$2=11,VLOOKUP(übertrag!I9,elfü,2,),IF($H$2=12,VLOOKUP(übertrag!I9,Heimü,2,),\"\"))))))","v":""},{"$f":"IF(übertrag!$H$2=1,VLOOKUP(übertrag!I9,_jhg1,2,),IF($H$2=2,VLOOKUP(übertrag!I9,_jhg2,2,),IF($H$2=3,VLOOKUP(übertrag!I9,_jhg3,2,),IF($H$2=4,VLOOKUP(übertrag!I9,_jhg4,2,),IF($H$2=5,VLOOKUP(übertrag!I9,_jhg5,2,),IF($H$2=6,VLOOKUP(übertrag!I9,_jhg6,2,),\"\"))))))","v":0},{"$f":"IF(übertrag!$H$2=7,VLOOKUP(übertrag!I9,_jhg7,2,),IF($H$2=8,VLOOKUP(übertrag!I9,_jhg8,2,),IF($H$2=9,VLOOKUP(übertrag!I9,_jhg9,2,),IF($H$2=10,VLOOKUP(übertrag!I9,_jhg10,2,),IF($H$2=11,VLOOKUP(übertrag!I9,_jhg11,2,),IF($H$2=12,VLOOKUP(übertrag!I9,jhgheim,2,),\"\"))))))","v":""},{"$f":"IF(übertrag!$H$2=1,VLOOKUP(übertrag!I9,paß1,2,),IF($H$2=2,VLOOKUP(übertrag!I9,paß2,2,),IF($H$2=3,VLOOKUP(übertrag!I9,paß3,2,),IF($H$2=4,VLOOKUP(übertrag!I9,paß4,2,),IF($H$2=5,VLOOKUP(übertrag!I9,paß5,2,),IF($H$2=6,VLOOKUP(übertrag!I9,paß6,2,),\"\"))))))","v":0},{"$f":"IF(übertrag!$H$2=7,VLOOKUP(übertrag!I9,paß7,2,),IF($H$2=8,VLOOKUP(übertrag!I9,paß8,2,),IF($H$2=9,VLOOKUP(übertrag!I9,paß9,2,),IF($H$2=10,VLOOKUP(übertrag!I9,paß10,2,),IF($H$2=11,VLOOKUP(übertrag!I9,paß11,2,),IF($H$2=12,VLOOKUP(übertrag!I9,paßheim,2,),\"\"))))))","v":""},false,null,null,null,8,{"$f":"'MANNSCHAFTEN+SPIELER'!A150","v":"Gastmannschaft 8"},null,null,null,{"$f":"IF(I23,VLOOKUP(übertrag!I23,Heimü,2,),\"\")","v":0},null,null,null,null,8]
[null,9,9,null,null,null,null,null,1,null,{"$f":"IF(übertrag!$H$2=1,VLOOKUP(übertrag!I10,einsü,2,),IF($H$2=2,VLOOKUP(übertrag!I10,zweiü,2,),IF($H$2=3,VLOOKUP(übertrag!I10,dreiü,2,),IF($H$2=4,VLOOKUP(übertrag!I10,vierü,2,),IF($H$2=5,VLOOKUP(übertrag!I10,fünfü,2,),IF($H$2=6,VLOOKUP(übertrag!I10,sechsü,2,),\"\"))))))","v":0},{"$f":"IF(übertrag!$H$2=7,VLOOKUP(übertrag!I10,siebenü,2,),IF($H$2=8,VLOOKUP(übertrag!I10,achtü,2,),IF($H$2=9,VLOOKUP(übertrag!I10,neunü,2,),IF($H$2=10,VLOOKUP(übertrag!I10,zehnü,2,),IF($H$2=11,VLOOKUP(übertrag!I10,elfü,2,),IF($H$2=12,VLOOKUP(übertrag!I10,Heimü,2,),\"\"))))))","v":""},{"$f":"IF(übertrag!$H$2=1,VLOOKUP(übertrag!I10,_jhg1,2,),IF($H$2=2,VLOOKUP(übertrag!I10,_jhg2,2,),IF($H$2=3,VLOOKUP(übertrag!I10,_jhg3,2,),IF($H$2=4,VLOOKUP(übertrag!I10,_jhg4,2,),IF($H$2=5,VLOOKUP(übertrag!I10,_jhg5,2,),IF($H$2=6,VLOOKUP(übertrag!I10,_jhg6,2,),\"\"))))))","v":0},{"$f":"IF(übertrag!$H$2=7,VLOOKUP(übertrag!I10,_jhg7,2,),IF($H$2=8,VLOOKUP(übertrag!I10,_jhg8,2,),IF($H$2=9,VLOOKUP(übertrag!I10,_jhg9,2,),IF($H$2=10,VLOOKUP(übertrag!I10,_jhg10,2,),IF($H$2=11,VLOOKUP(übertrag!I10,_jhg11,2,),IF($H$2=12,VLOOKUP(übertrag!I10,jhgheim,2,),\"\"))))))","v":""},{"$f":"IF(übertrag!$H$2=1,VLOOKUP(übertrag!I10,paß1,2,),IF($H$2=2,VLOOKUP(übertrag!I10,paß2,2,),IF($H$2=3,VLOOKUP(übertrag!I10,paß3,2,),IF($H$2=4,VLOOKUP(übertrag!I10,paß4,2,),IF($H$2=5,VLOOKUP(übertrag!I10,paß5,2,),IF($H$2=6,VLOOKUP(übertrag!I10,paß6,2,),\"\"))))))","v":0},{"$f":"IF(übertrag!$H$2=7,VLOOKUP(übertrag!I10,paß7,2,),IF($H$2=8,VLOOKUP(übertrag!I10,paß8,2,),IF($H$2=9,VLOOKUP(übertrag!I10,paß9,2,),IF($H$2=10,VLOOKUP(übertrag!I10,paß10,2,),IF($H$2=11,VLOOKUP(übertrag!I10,paß11,2,),IF($H$2=12,VLOOKUP(übertrag!I10,paßheim,2,),\"\"))))))","v":""},false,null,null,null,9,{"$f":"'MANNSCHAFTEN+SPIELER'!A171","v":"Gastmannschaft 9"},null,null,null,{"$f":"IF(I24,VLOOKUP(übertrag!I24,Heimü,2,),\"\")","v":0},null,null,null,null,9]
[null,null,null,null,null,null,null,null,1,null,{"$f":"IF(übertrag!$H$2=1,VLOOKUP(übertrag!I11,einsü,2,),IF($H$2=2,VLOOKUP(übertrag!I11,zweiü,2,),IF($H$2=3,VLOOKUP(übertrag!I11,dreiü,2,),IF($H$2=4,VLOOKUP(übertrag!I11,vierü,2,),IF($H$2=5,VLOOKUP(übertrag!I11,fünfü,2,),IF($H$2=6,VLOOKUP(übertrag!I11,sechsü,2,),\"\"))))))","v":0},{"$f":"IF(übertrag!$H$2=7,VLOOKUP(übertrag!I11,siebenü,2,),IF($H$2=8,VLOOKUP(übertrag!I11,achtü,2,),IF($H$2=9,VLOOKUP(übertrag!I11,neunü,2,),IF($H$2=10,VLOOKUP(übertrag!I11,zehnü,2,),IF($H$2=11,VLOOKUP(übertrag!I11,elfü,2,),IF($H$2=12,VLOOKUP(übertrag!I11,Heimü,2,),\"\"))))))","v":""},{"$f":"IF(übertrag!$H$2=1,VLOOKUP(übertrag!I11,_jhg1,2,),IF($H$2=2,VLOOKUP(übertrag!I11,_jhg2,2,),IF($H$2=3,VLOOKUP(übertrag!I11,_jhg3,2,),IF($H$2=4,VLOOKUP(übertrag!I11,_jhg4,2,),IF($H$2=5,VLOOKUP(übertrag!I11,_jhg5,2,),IF($H$2=6,VLOOKUP(übertrag!I11,_jhg6,2,),\"\"))))))","v":0},{"$f":"IF(übertrag!$H$2=7,VLOOKUP(übertrag!I11,_jhg7,2,),IF($H$2=8,VLOOKUP(übertrag!I11,_jhg8,2,),IF($H$2=9,VLOOKUP(übertrag!I11,_jhg9,2,),IF($H$2=10,VLOOKUP(übertrag!I11,_jhg10,2,),IF($H$2=11,VLOOKUP(übertrag!I11,_jhg11,2,),IF($H$2=12,VLOOKUP(übertrag!I11,jhgheim,2,),\"\"))))))","v":""},{"$f":"IF(übertrag!$H$2=1,VLOOKUP(übertrag!I11,paß1,2,),IF($H$2=2,VLOOKUP(übertrag!I11,paß2,2,),IF($H$2=3,VLOOKUP(übertrag!I11,paß3,2,),IF($H$2=4,VLOOKUP(übertrag!I11,paß4,2,),IF($H$2=5,VLOOKUP(übertrag!I11,paß5,2,),IF($H$2=6,VLOOKUP(übertrag!I11,paß6,2,),\"\"))))))","v":0},{"$f":"IF(übertrag!$H$2=7,VLOOKUP(übertrag!I11,paß7,2,),IF($H$2=8,VLOOKUP(übertrag!I11,paß8,2,),IF($H$2=9,VLOOKUP(übertrag!I11,paß9,2,),IF($H$2=10,VLOOKUP(übertrag!I11,paß10,2,),IF($H$2=11,VLOOKUP(übertrag!I11,paß11,2,),IF($H$2=12,VLOOKUP(übertrag!I11,paßheim,2,),\"\"))))))","v":""},false,null,null,null,10,{"$f":"'MANNSCHAFTEN+SPIELER'!A192","v":"Gastmannschaft 10"},null,null,null,{"$f":"IF(I25,VLOOKUP(übertrag!I25,Heimü,2,),\"\")","v":0},null,null,null,null,10]
[null,null,null,null,null,null,null,null,1,null,{"$f":"IF(übertrag!$H$2=1,VLOOKUP(übertrag!I12,einsü,2,),IF($H$2=2,VLOOKUP(übertrag!I12,zweiü,2,),IF($H$2=3,VLOOKUP(übertrag!I12,dreiü,2,),IF($H$2=4,VLOOKUP(übertrag!I12,vierü,2,),IF($H$2=5,VLOOKUP(übertrag!I12,fünfü,2,),IF($H$2=6,VLOOKUP(übertrag!I12,sechsü,2,),\"\"))))))","v":0},{"$f":"IF(übertrag!$H$2=7,VLOOKUP(übertrag!I12,siebenü,2,),IF($H$2=8,VLOOKUP(übertrag!I12,achtü,2,),IF($H$2=9,VLOOKUP(übertrag!I12,neunü,2,),IF($H$2=10,VLOOKUP(übertrag!I12,zehnü,2,),IF($H$2=11,VLOOKUP(übertrag!I12,elfü,2,),IF($H$2=12,VLOOKUP(übertrag!I12,Heimü,2,),\"\"))))))","v":""},{"$f":"IF(übertrag!$H$2=1,VLOOKUP(übertrag!I12,_jhg1,2,),IF($H$2=2,VLOOKUP(übertrag!I12,_jhg2,2,),IF($H$2=3,VLOOKUP(übertrag!I12,_jhg3,2,),IF($H$2=4,VLOOKUP(übertrag!I12,_jhg4,2,),IF($H$2=5,VLOOKUP(übertrag!I12,_jhg5,2,),IF($H$2=6,VLOOKUP(übertrag!I12,_jhg6,2,),\"\"))))))","v":0},{"$f":"IF(übertrag!$H$2=7,VLOOKUP(übertrag!I12,_jhg7,2,),IF($H$2=8,VLOOKUP(übertrag!I12,_jhg8,2,),IF($H$2=9,VLOOKUP(übertrag!I12,_jhg9,2,),IF($H$2=10,VLOOKUP(übertrag!I12,_jhg10,2,),IF($H$2=11,VLOOKUP(übertrag!I12,_jhg11,2,),IF($H$2=12,VLOOKUP(übertrag!I12,jhgheim,2,),\"\"))))))","v":""},{"$f":"IF(übertrag!$H$2=1,VLOOKUP(übertrag!I12,paß1,2,),IF($H$2=2,VLOOKUP(übertrag!I12,paß2,2,),IF($H$2=3,VLOOKUP(übertrag!I12,paß3,2,),IF($H$2=4,VLOOKUP(übertrag!I12,paß4,2,),IF($H$2=5,VLOOKUP(übertrag!I12,paß5,2,),IF($H$2=6,VLOOKUP(übertrag!I12,paß6,2,),\"\"))))))","v":0},{"$f":"IF(übertrag!$H$2=7,VLOOKUP(übertrag!I12,paß7,2,),IF($H$2=8,VLOOKUP(übertrag!I12,paß8,2,),IF($H$2=9,VLOOKUP(übertrag!I12,paß9,2,),IF($H$2=10,VLOOKUP(übertrag!I12,paß10,2,),IF($H$2=11,VLOOKUP(übertrag!I12,paß11,2,),IF($H$2=12,VLOOKUP(übertrag!I12,paßheim,2,),\"\"))))))","v":""},null,null,null,null,11,{"$f":"'MANNSCHAFTEN+SPIELER'!A213","v":"Gastmannschaft 11"},null,null,null,{"$f":"IF(I26,VLOOKUP(übertrag!I26,Heimü,2,),\"\")","v":0},null,null,null,null,11]
[null,null,null,null,null,null,null,null,1,null,{"$f":"IF(übertrag!$H$2=1,VLOOKUP(übertrag!I13,einsü,2,),IF($H$2=2,VLOOKUP(übertrag!I13,zweiü,2,),IF($H$2=3,VLOOKUP(übertrag!I13,dreiü,2,),IF($H$2=4,VLOOKUP(übertrag!I13,vierü,2,),IF($H$2=5,VLOOKUP(übertrag!I13,fünfü,2,),IF($H$2=6,VLOOKUP(übertrag!I13,sechsü,2,),\"\"))))))","v":0},{"$f":"IF(übertrag!$H$2=7,VLOOKUP(übertrag!I13,siebenü,2,),IF($H$2=8,VLOOKUP(übertrag!I13,achtü,2,),IF($H$2=9,VLOOKUP(übertrag!I13,neunü,2,),IF($H$2=10,VLOOKUP(übertrag!I13,zehnü,2,),IF($H$2=11,VLOOKUP(übertrag!I13,elfü,2,),IF($H$2=12,VLOOKUP(übertrag!I13,Heimü,2,),\"\"))))))","v":""},{"$f":"IF(übertrag!$H$2=1,VLOOKUP(übertrag!I13,_jhg1,2,),IF($H$2=2,VLOOKUP(übertrag!I13,_jhg2,2,),IF($H$2=3,VLOOKUP(übertrag!I13,_jhg3,2,),IF($H$2=4,VLOOKUP(übertrag!I13,_jhg4,2,),IF($H$2=5,VLOOKUP(übertrag!I13,_jhg5,2,),IF($H$2=6,VLOOKUP(übertrag!I13,_jhg6,2,),\"\"))))))","v":0},{"$f":"IF(übertrag!$H$2=7,VLOOKUP(übertrag!I13,_jhg7,2,),IF($H$2=8,VLOOKUP(übertrag!I13,_jhg8,2,),IF($H$2=9,VLOOKUP(übertrag!I13,_jhg9,2,),IF($H$2=10,VLOOKUP(übertrag!I13,_jhg10,2,),IF($H$2=11,VLOOKUP(übertrag!I13,_jhg11,2,),IF($H$2=12,VLOOKUP(übertrag!I13,jhgheim,2,),\"\"))))))","v":""},{"$f":"IF(übertrag!$H$2=1,VLOOKUP(übertrag!I13,paß1,2,),IF($H$2=2,VLOOKUP(übertrag!I13,paß2,2,),IF($H$2=3,VLOOKUP(übertrag!I13,paß3,2,),IF($H$2=4,VLOOKUP(übertrag!I13,paß4,2,),IF($H$2=5,VLOOKUP(übertrag!I13,paß5,2,),IF($H$2=6,VLOOKUP(übertrag!I13,paß6,2,),\"\"))))))","v":0},{"$f":"IF(übertrag!$H$2=7,VLOOKUP(übertrag!I13,paß7,2,),IF($H$2=8,VLOOKUP(übertrag!I13,paß8,2,),IF($H$2=9,VLOOKUP(übertrag!I13,paß9,2,),IF($H$2=10,VLOOKUP(übertrag!I13,paß10,2,),IF($H$2=11,VLOOKUP(übertrag!I13,paß11,2,),IF($H$2=12,VLOOKUP(übertrag!I13,paßheim,2,),\"\"))))))","v":""},null,null,null,null,12,{"$f":"'MANNSCHAFTEN+SPIELER'!O3","v":"1.SKK Gut Holz Zeil 1"},null,null,null,{"$f":"IF(I27,VLOOKUP(übertrag!I27,Heimü,2,),\"\")","v":"Andreas Aumüller"},null,null,null,null,12]
[null,null,null,null,null,null,null,null,10,null,null,null,null,null,null,null,null,null,null,null,13,null,null,null,null,{"$f":"IF(I28,VLOOKUP(übertrag!I28,Heimü,2,),\"\")","v":0},null,null,null,null,13]
[null,null,null,null,null,null,null,null,null,null,null,null,null,null,null,null,null,null,null,null,14,null,null,null,null,{"$f":"IF(I29,VLOOKUP(übertrag!I29,Heimü,2,),\"\")","v":0},null,null,null,null,14]
[null,null,null,null,null,null,null,null,2,null,{"$f":"IF(I16,VLOOKUP(übertrag!I16,paßheim,2,),\"\")","v":120763},null,{"$f":"IF(I16,VLOOKUP(übertrag!I16,jhgheim,2,),\"\")","v":"06.72"},null,{"$f":"IF(übertrag!I16,VLOOKUP(übertrag!I16,paßheim,2,),\"\")","v":120763},null,true,null,null,null,null,null,null,null,null,{"$f":"IF(I25,VLOOKUP(übertrag!I25,Heimü,2,),\"\")","v":0},null,null,null,null,15]
[null,9,9,null,null,null,null,null,3,null,{"$f":"IF(I17,VLOOKUP(übertrag!I17,paßheim,2,),\"\")","v":79060},null,{"$f":"IF(I17,VLOOKUP(übertrag!I17,jhgheim,2,),\"\")","v":"10.03"},null,{"$f":"IF(übertrag!I17,VLOOKUP(übertrag!I17,paßheim,2,),\"\")","v":79060},null,true,null,null,null,null,null,null,null,null,{"$f":"IF(I26,VLOOKUP(übertrag!I26,Heimü,2,),\"\")","v":0},null,null,null,null,16]
[null,1,null,null,null,null,null,null,4,null,{"$f":"IF(I18,VLOOKUP(übertrag!I18,paßheim,2,),\"\")","v":29339},null,{"$f":"IF(I18,VLOOKUP(übertrag!I18,jhgheim,2,),\"\")","v":"06.00"},null,{"$f":"IF(übertrag!I18,VLOOKUP(übertrag!I18,paßheim,2,),\"\")","v":29339},null,true,null,null,null,null,null,null,null,null,{"$f":"IF(I27,VLOOKUP(übertrag!I27,Heimü,2,),\"\")","v":"Andreas Aumüller"},null,null,null,null,17]
[null,9,9,null,null,null,null,null,5,null,{"$f":"IF(I19,VLOOKUP(übertrag!I19,paßheim,2,),\"\")","v":120769},null,{"$f":"IF(I19,VLOOKUP(übertrag!I19,jhgheim,2,),\"\")","v":"07.69"},null,{"$f":"IF(übertrag!I19,VLOOKUP(übertrag!I19,paßheim,2,),\"\")","v":120769},null,true,null,null,null,null,null,null,null,null,null,null,null,null,null,18]
[null,null,null,null,null,null,null,null,6,null,{"$f":"IF(I20,VLOOKUP(übertrag!I20,paßheim,2,),\"\")","v":120774},null,{"$f":"IF(I20,VLOOKUP(übertrag!I20,jhgheim,2,),\"\")","v":"07.61"},null,{"$f":"IF(übertrag!I20,VLOOKUP(übertrag!I20,paßheim,2,),\"\")","v":120774},null,false,null,null,null,null,null,null,null,null,null,null,null,null,null,19]
[null,null,null,null,null,null,null,null,7,null,{"$f":"IF(I21,VLOOKUP(übertrag!I21,paßheim,2,),\"\")","v":23647},null,{"$f":"IF(I21,VLOOKUP(übertrag!I21,jhgheim,2,),\"\")","v":"01.98"},null,{"$f":"IF(übertrag!I21,VLOOKUP(übertrag!I21,paßheim,2,),\"\")","v":23647},null,true,null,null,null,null,null,null,null,null,null,null,null,null,null,20]
[null,null,null,null,null,null,null,null,8,null,{"$f":"IF(I22,VLOOKUP(übertrag!I22,paßheim,2,),\"\")","v":120812},null,{"$f":"IF(I22,VLOOKUP(übertrag!I22,jhgheim,2,),\"\")","v":"07.97"},null,{"$f":"IF(übertrag!I22,VLOOKUP(übertrag!I22,paßheim,2,),\"\")","v":120812},null,true,null,null,null,null,null,null,null,null,null,null,null,null,null,21]
[null,null,null,null,null,null,null,null,1,null,{"$f":"IF(I23,VLOOKUP(übertrag!I23,paßheim,2,),\"\")","v":0},null,{"$f":"IF(I23,VLOOKUP(übertrag!I23,jhgheim,2,),\"\")","v":"00:00:00"},null,{"$f":"IF(übertrag!I23,VLOOKUP(übertrag!I23,paßheim,2,),\"\")","v":0},null,false,null,null,null,null,null,null,null,null,null,null,null,null,null,22]
[null,null,null,null,null,null,null,null,1,null,{"$f":"IF(I24,VLOOKUP(übertrag!I24,paßheim,2,),\"\")","v":0},null,{"$f":"IF(I24,VLOOKUP(übertrag!I24,jhgheim,2,),\"\")","v":"00:00:00"},null,{"$f":"IF(übertrag!I24,VLOOKUP(übertrag!I24,paßheim,2,),\"\")","v":0},null,false]
[null,null,null,null,null,null,null,null,1,null,{"$f":"IF(I25,VLOOKUP(übertrag!I25,paßheim,2,),\"\")","v":0},null,{"$f":"IF(I25,VLOOKUP(übertrag!I25,jhgheim,2,),\"\")","v":"00:00:00"},null,{"$f":"IF(übertrag!I25,VLOOKUP(übertrag!I25,paßheim,2,),\"\")","v":0},null,true,null,null,null,null,null,null,null,null,null,null,null,null,null,14]
[null,null,null,null,null,null,null,null,1,null,{"$f":"IF(I26,VLOOKUP(übertrag!I26,paßheim,2,),\"\")","v":0},null,{"$f":"IF(I26,VLOOKUP(übertrag!I26,jhgheim,2,),\"\")","v":"00:00:00"},null,{"$f":"IF(übertrag!I26,VLOOKUP(übertrag!I26,paßheim,2,),\"\")","v":0},null,false]
[null,null,null,null,null,null,null,null,8,null,{"$f":"IF(I27,VLOOKUP(übertrag!I27,paßheim,2,),\"\")","v":120812},null,{"$f":"IF(I27,VLOOKUP(übertrag!I27,jhgheim,2,),\"\")","v":"07.97"},null,{"$f":"IF(übertrag!I27,VLOOKUP(übertrag!I27,paßheim,2,),\"\")","v":120812},null,true]
[null,null,null,null,null,null,null,null,1,null,{"$f":"IF(I28,VLOOKUP(übertrag!I28,paßheim,2,),\"\")","v":0},null,{"$f":"IF(I28,VLOOKUP(übertrag!I28,jhgheim,2,),\"\")","v":"00:00:00"},null,{"$f":"IF(übertrag!I28,VLOOKUP(übertrag!I28,paßheim,2,),\"\")","v":0},null,false]
[null,null,null,null,null,null,null,null,13,null,null,null,{"$f":"IF(I29,VLOOKUP(übertrag!I29,jhgheim,2,),\"\")","v":"00:00:00"},null,{"$f":"IF(übertrag!I29,VLOOKUP(übertrag!I29,paßheim,2,),\"\")","v":0},null,true]
[null,null,null,null,null,null,null,null,null,null,null,null,{"$f":"IF(I30,VLOOKUP(übertrag!I30,jhgheim,2,),\"\")","v":""},null,{"$f":"IF(übertrag!I30,VLOOKUP(übertrag!I30,paßheim,2,),\"\")","v":""},null,false]
[null,null,null,null,null,null,null,null,null,null,null,null,{"$f":"IF(I31,VLOOKUP(übertrag!I31,jhgheim,2,),\"\")","v":""},null,{"$f":"IF(übertrag!I31,VLOOKUP(übertrag!I31,paßheim,2,),\"\")","v":""},null,false]
[null,null,null,null,null,null,null,null,null,null,null,null,{"$f":"IF(I32,VLOOKUP(übertrag!I32,jhgheim,2,),\"\")","v":""},null,{"$f":"IF(übertrag!I32,VLOOKUP(übertrag!I32,paßheim,2,),\"\")","v":""},null,false]
[null,null,null,null,null,null,null,null,null,null,null,null,{"$f":"IF(I33,VLOOKUP(übertrag!I33,jhgheim,2,),\"\")","v":""},null,{"$f":"IF(übertrag!I33,VLOOKUP(übertrag!I33,paßheim,2,),\"\")","v":""},null,false]
[]
[]
[]
[]
[]
[]
[]
[]
[]
[]
[]
[]
[]
[]
[]
[]
[]
[]
[]
[]
[]
[]
[]
[]
[]
[]
[]
[]
[]
[]
[]
[]
[]
[]
[]
[]
[]
[]
[]
[]
[]
[]
[]
[]
[]
[]
[]
[]
[]
[]
[]
[]
[]
[]
[]
[]
[]
[]
[]
[]
[]
[]
[]
[]
[]
[]
[]
[]
[]
[]
[]
[]
[]
[]
[]
[]
[]
[]
[]
[]
[]
[]
[]
[null,null,null,null,null,null,"Bemerkungen zu:"]